{"text_format":"1","workbook":"xlsx","n_sheets":2,"sheets":["CrediAltoque (SI)","Calculos CrediAltoque"],"not_rendered":{"charts":0,"images":1,"macros":1,"external_links":0,"defined_names":0,"comments":0,"pivot_tables":0},"unopened":[],"bounds":{"document_bytes":16777216,"sheet_cells":100000,"rows_first":2000,"rows_last":500,"rows_between":2000,"halvings":0,"cell_chars":16384,"cell_head_chars":4096},"cells_cut":0,"cells_raw":0,"read":"whole","date_system":"1900"}

{"sheet":"CrediAltoque (SI)","index":0,"n_rows":89,"n_cols":46,"rows_kept":89,"cut":false,"hidden":false,"merged":[[33,36,33,37],[30,18,30,19],[1,10,1,31],[2,10,2,23]]}
[]
[null,null,null,null,null,null,null,null,null,null,"SIMULADOR DE CUOTAS -CREDIALTOQUE"]
[null,null,null,null,null,null,null,null,null,null,"¡Hola! Usa este simulador para conocer el valor referencial de tu Pago Total de Cuota (P) mensual cuando compres en Tiendas Carsa, Marcimex y El Gallo más Gallo con tu Credialtoque. \nRecuerda que:\n- Electro hasta 30 meses\n- Motos has 36 meses"]
[]
[null,null,"Moneda",null,null,null,null,null,null,null,null,"Soles"]
[null,null,"Importe Solicitado (soles S/.)",null,null,null,null,null,null,null,null,3500,null,null,null,null,null,"Fecha Desembolso",null,null,null,null,null,{"$f":"TODAY()","v":"2023-02-01"}]
[null,null,"Saldo de Capital",null,null,null,null,null,null,null,null,{"$f":"L6","v":3500},null,null,null,null,null,"Fecha de la 1° cuota",null,null,null,null,null,{"$f":"IF(R9<=15,DATE(YEAR(EDATE(W9,1)),MONTH(EDATE(W9,1)),DAY(15)),DATE(YEAR(EDATE(W9,2)),MONTH(EDATE(W9,1)),DAY(3)))","v":"2023-03-15"}]
[null,null,"Saldo de Interes",null,null,null,null,null,null,null,null,0,null,null,null,null,null,"Fecha final de vencimiento",null,null,null,null,null,{"$f":"IF(OR($H$18>0,$H$19>0),VLOOKUP($L$15,$A$35:$C$74,3,0),DATE(YEAR(EDATE(W9,L15)),MONTH(EDATE(W9,L15)),DAY(EDATE(W9,L15))))","v":"2024-02-15"}]
[null,null,"Tasa Anual (TEA) - Fija",null,null,null,null,null,null,null,null,83,"Fecha Final de Gracia",null,null,null,null,{"$f":"DAY(X6)","v":1},null,null,null,null,{"$f":"IF(R9<=15,DATE(YEAR(EDATE(X6+H17,1)),MONTH(EDATE(X6,0)),DAY(15)),DATE(YEAR(EDATE(X6+H17,1)),MONTH(EDATE(X6,1)),DAY(3)))","v":"2023-02-15"}]
[null,null,"Tasa de Seguro de Desgravamen",null,null,null,null,null,null,null,null,"Seguro Con Retorno",null,null,null,null,null,null,null,null,null,null,360]
[null,null,"Tasa Anual (TEA) - Ajustada",null,null,null,null,null,null,null,null,{"$f":"+L9","v":83},"Frecuencia pago en días",null,null,null,null,null,null,null,null,null,30]
[null,null,"Comision por Env. Inf",null,null,null,null,null,null,null,null,0,"Tasa Equivalente - Ajustada",null,null,null,null,{"$f":"ROUND((((L11/100+1)^(1/(W10/W11))-1)*W10/W11)*100,6)","v":61.979121999999997},"tea conv. A tem luego nominal anual"]
[null,null,"Valor Asegurable",null,null,null,null,null,null,null,null,0,"Días entre cuotas",null,null,null,null,{"$f":"(X8-W9)/L15","v":30.416666666666668},"dias promedio entre cuotas"]
[null,null,"Tasa de Seguro Todo Riesgo",null,null,null,null,null,null,{"$f":"+L14*12","v":0},null,0,"Factor Aplicado - Ajustada",null,null,null,null,{"$f":"ROUND(($R$12/100)/($W$10/$R$13),8)","v":5.2366620000000003E-2},"tem convertida de manera nominal a los dias entre cuotas"]
[null,null,"Plazo y  Nro. Cuotas",null,null,null,null,null,null,{"$f":"L15","v":12},null,12,"Factor Aplicado para la cuota - Ajustada",null,null,null,null,{"$f":"1/((1-((1+$R$14)^(-1*$L$15)))/$R$14)","v":0.11433633410663963},"Factor de cuota (ok)"]
[null,null,"Tasa de Costo Efectivo Anual",null,null,null,null,null,null,null,null,{"$f":"AI22*100","v":95.745608788597721}]
[null,null,"Días de Gracia",null,null,null,null,0,null,null,null,null,"Interes de Gracia  (Se considera la TEA Normal)",null,null,null,null,{"$f":"IF(H17>0,ROUND(L7*(((1+L9/100)^(ABS(H17)/W10))-1),4),ROUND(L7*(((1+L9/100)^(ABS(H17)/W10))-1),4) * -1)","v":0},"Ok"]
[null,null,"Mes de No Pago 1",null,null,null,null,0,null,null,null,null,"Saldo Interes +/- Interes Gracia",null,null,null,null,{"$f":"IF(L8 + R17>0,L8+ R17,0)","v":0}]
[null,null,"Mes de No Pago 2",null,null,null,null,0,null,null,null,null,"Seg Desg de Gracia",null,null,null,null,{"$f":"IF(H17>0,ROUNDDOWN(L6*L10/30*H17,2),ROUNDDOWN(L6*L10/30*H17,2)*0)","v":{"$error":"#VALUE!"}}]
[null,null,"Mes Cuota Doble 1",null,null,null,null,0,null,null,null,null,"TCEA",null,null,null,null,{"$f":"+$AI$33","v":0.95745608788597725}]
[null,null,"Mes Cuota Doble 2",null,null,null," ",0]
[null,null,null,null,null,null,null,null,null,null,null,null,null,null,null,null,null,null,null,null,null,null,null,null,null,null,null,null,null,null,null,null,null,"TIR",{"$f":"(1+XIRR(AI34:AI74,AH34:AH74))^(360/365)-1","v":0.95745608788597725}]
[null,null,null,null,null,null,null,null,null,null,null,null,null,null,null,"Suavización",null,null,null,null,null,"Validador Cuota Doble"]
[null,null,null,null,null,null,null,null,null,null,null,null,null,null,null,"Ultimo saldo de Principal",null,{"$f":"VLOOKUP(J15,$F$34:$X$74,18,FALSE)","v":423.55500000000478},null,null,null,"Cuota Simple",null,{"$f":"+VLOOKUP(\"\",$D$35:$W$74,19,0)","v":0}]
[null,null,3.5000000000000001E-3,"Seguro Sin Retorno",null,"Valor de cuota por dias de gracia",null,null,null,{"$f":"+ROUND(IF(OR(H18+H19>0,H20+H21>0),R18/VLOOKUP(L15,'Calculos CrediAltoque'!$A$3:$G$243,7,FALSE),'CrediAltoque (SI)'!R18*'CrediAltoque (SI)'!$R$15),2)","v":0},{"$f":"R18/SUM(AO35:INDIRECT(CONCATENATE(\"AE\",32+J15-1)))","v":{"$error":"#REF!"}},null,null,null,null,"Numero de Dias",null,{"$f":"X8-W9","v":365},null,null,null,"Cuota Doble",null,{"$f":"+IFERROR(VLOOKUP(\"D\",$D$35:$W$74,19,0),\" \")","v":" "}]
[null,null,1.0999999999999999E-2,"Seguro Con Retorno",null,"Valor de cuota por capital",null,null,null,{"$f":"ROUND(IF(OR(H18 + H19 > 0,H20 + H21>0), ROUNDUP(L7/VLOOKUP(L15,'Calculos CrediAltoque'!$A$3:$G$243,7,FALSE),2),L7*$R$15),2)","v":400.18},null,null,"sin desgravamen",null,null,"Valor de Cuota Nivelada",null,{"$f":"ROUND(+R24/ROUND(1*(((1+L11/100)^(R25/W10))-1),4),2)","v":501.01},null,null,null,"Factor",null,{"$f":"+IFERROR(X25/X24,\" \")","v":" "}]
[null,null,0,"Endoso",null,"Valor de Seg Desg por dia de gracia",null,null,null,{"$f":"$R$19/(($J$15+COUNTIF(D35:INDIRECT(CONCATENATE(\"C\",32+J15-1)),\"D\"))*(1/((1+0)^($W$11/$W$10))))","v":{"$error":"#VALUE!"}}]
[null,null,{"$f":"INDEX(C25:C27,MATCH(L10,D25:D27,0))","v":1.0999999999999999E-2},null,null,"Seguro de Desgravamen (FPF)",null,null,null,{"$f":"$L$6*$L$10","v":{"$error":"#VALUE!"}},null,null,null,null,null,"Factor Ajuste",null,{"$f":"R26*R15","v":57.283646750767517},null,"Se copia LO DEL COSTADO  a partir de la primera corrida",null,"Calce de Capital"]
[null,null,null,null,null,"Comision por Env.Inf",null,null,null,0,null,null,null,null,null,"Exceso de Int + Gracia",null,{"$f":"SUM(Y35:Y74)","v":0},{"$f":"ROUND(IF(OR(H18+ H19> 0,H20 + H21>0),ROUNDUP($R$29/VLOOKUP(L15,'Calculos CrediAltoque'!$A$3:$G$243,7,FALSE),2),$R$29*$R$15),2)","v":0},0,null,"Suma Capital (K)",null,{"$f":"+SUM($K$35:$K$74)","v":3500.0000000000573}]
[null,null,null,null,null,"Seguro Todo Riesgo",null,null,null,{"$f":"ROUND($L$13*$L$14,2)","v":0},null,null,null,null,null,"Factor Ajuste 2",null,{"$f":"+R24/L15","v":35.296250000000398},null,null,null,"Validador",null,{"$f":"+$L$6-X29","v":-5.7298166211694479E-11},null,null,null,"<- El valor tiene que ser cercano a cero."]
{"$rows_left_out":60}
{"sheet":"Calculos CrediAltoque","index":1,"n_rows":386,"n_cols":7,"rows_kept":386,"cut":false,"hidden":true,"merged":[[0,0,0,6]]}
["Factores utilizados en Meses de No Pago para cálculo del valor cuota"]
[]
["N° de Cuota","Equivalente","Fecha","Mes","Marca Cuota No Pago","Factor (10)","Acumulado"]
[1,{"$f":"IF(E4<>\"C\",IF(ISERROR(1+B3)=TRUE,1,1+B3),IF(ISNUMBER(B3),B3,1))","v":1},{"$f":"+'CrediAltoque (SI)'!$X$7","v":"2023-03-15"},{"$f":"MONTH(C4)","v":3},{"$f":"IF(ISERROR(MATCH(D4,'CrediAltoque (SI)'!$H$18:$H$19,0))=FALSE,\"C\",IF(ISERROR(MATCH(D4,'CrediAltoque (SI)'!$H$20:$H$21,0))=FALSE,\"D\",\"\"))","v":""},{"$f":"IF(E4=\"C\",0,IF(E4 =\"D\",ROUND(1/((1+'CrediAltoque (SI)'!$R$14)^A4),9) * 2,ROUND(1/((1+'CrediAltoque (SI)'!$R$14)^A4),9)))","v":0.95023918600000001},{"$f":"ROUND(F4,9)","v":0.95023918600000001}]
[{"$f":"A4+1","v":2},{"$f":"IF(E5<>\"C\",IF(ISERROR(1+B4)=TRUE,1,1+B4),IF(ISNUMBER(B4),B4,1))","v":2},{"$f":"DATE(YEAR(C4) + 1/12,MONTH(C4)+1,DAY(C4))","v":"2023-04-15"},4,{"$f":"IF(ISERROR(MATCH(D5,'CrediAltoque (SI)'!$H$18:$H$19,0))=FALSE,\"C\",IF(ISERROR(MATCH(D5,'CrediAltoque (SI)'!$H$20:$H$21,0))=FALSE,\"D\",\"\"))","v":""},{"$f":"IF(E5=\"C\",0,IF(E5 =\"D\",ROUND(1/((1+'CrediAltoque (SI)'!$R$14)^A5),9) * 2,ROUND(1/((1+'CrediAltoque (SI)'!$R$14)^A5),9)))","v":0.90295451000000004},{"$f":"G4+ROUND(F5,9)","v":1.8531936959999999}]
[3,3,"2023-05-15",5,{"$f":"IF(ISERROR(MATCH(D6,'CrediAltoque (SI)'!$H$18:$H$19,0))=FALSE,\"C\",IF(ISERROR(MATCH(D6,'CrediAltoque (SI)'!$H$20:$H$21,0))=FALSE,\"D\",\"\"))","v":""},{"$f":"IF(E6=\"C\",0,IF(E6 =\"D\",ROUND(1/((1+'CrediAltoque (SI)'!$R$14)^A6),9) * 2,ROUND(1/((1+'CrediAltoque (SI)'!$R$14)^A6),9)))","v":0.85802275800000005},{"$f":"G5+ROUND(F6,9)","v":2.7112164540000001}]
[4,4,"2023-06-15",6,{"$f":"IF(ISERROR(MATCH(D7,'CrediAltoque (SI)'!$H$18:$H$19,0))=FALSE,\"C\",IF(ISERROR(MATCH(D7,'CrediAltoque (SI)'!$H$20:$H$21,0))=FALSE,\"D\",\"\"))","v":""},{"$f":"IF(E7=\"C\",0,IF(E7 =\"D\",ROUND(1/((1+'CrediAltoque (SI)'!$R$14)^A7),9) * 2,ROUND(1/((1+'CrediAltoque (SI)'!$R$14)^A7),9)))","v":0.81532684700000002},3.5265433010000002]
[5,5,"2023-07-15",7,{"$f":"IF(ISERROR(MATCH(D8,'CrediAltoque (SI)'!$H$18:$H$19,0))=FALSE,\"C\",IF(ISERROR(MATCH(D8,'CrediAltoque (SI)'!$H$20:$H$21,0))=FALSE,\"D\",\"\"))","v":""},{"$f":"IF(E8=\"C\",0,IF(E8 =\"D\",ROUND(1/((1+'CrediAltoque (SI)'!$R$14)^A8),9) * 2,ROUND(1/((1+'CrediAltoque (SI)'!$R$14)^A8),9)))","v":0.77475551899999995},4.3012988200000004]
[6,6,"2023-08-15",8,{"$f":"IF(ISERROR(MATCH(D9,'CrediAltoque (SI)'!$H$18:$H$19,0))=FALSE,\"C\",IF(ISERROR(MATCH(D9,'CrediAltoque (SI)'!$H$20:$H$21,0))=FALSE,\"D\",\"\"))","v":""},{"$f":"IF(E9=\"C\",0,IF(E9 =\"D\",ROUND(1/((1+'CrediAltoque (SI)'!$R$14)^A9),9) * 2,ROUND(1/((1+'CrediAltoque (SI)'!$R$14)^A9),9)))","v":0.73620305399999997},5.0375018740000002]
[7,7,"2023-09-15",9,{"$f":"IF(ISERROR(MATCH(D10,'CrediAltoque (SI)'!$H$18:$H$19,0))=FALSE,\"C\",IF(ISERROR(MATCH(D10,'CrediAltoque (SI)'!$H$20:$H$21,0))=FALSE,\"D\",\"\"))","v":""},{"$f":"IF(E10=\"C\",0,IF(E10 =\"D\",ROUND(1/((1+'CrediAltoque (SI)'!$R$14)^A10),9) * 2,ROUND(1/((1+'CrediAltoque (SI)'!$R$14)^A10),9)))","v":0.69956898999999995},5.7370708639999997]
[8,8,"2023-10-15",10,{"$f":"IF(ISERROR(MATCH(D11,'CrediAltoque (SI)'!$H$18:$H$19,0))=FALSE,\"C\",IF(ISERROR(MATCH(D11,'CrediAltoque (SI)'!$H$20:$H$21,0))=FALSE,\"D\",\"\"))","v":""},{"$f":"IF(E11=\"C\",0,IF(E11 =\"D\",ROUND(1/((1+'CrediAltoque (SI)'!$R$14)^A11),9) * 2,ROUND(1/((1+'CrediAltoque (SI)'!$R$14)^A11),9)))","v":0.66475786800000003},6.4018287319999994]
[9,9,"2023-11-15",11,{"$f":"IF(ISERROR(MATCH(D12,'CrediAltoque (SI)'!$H$18:$H$19,0))=FALSE,\"C\",IF(ISERROR(MATCH(D12,'CrediAltoque (SI)'!$H$20:$H$21,0))=FALSE,\"D\",\"\"))","v":""},{"$f":"IF(E12=\"C\",0,IF(E12 =\"D\",ROUND(1/((1+'CrediAltoque (SI)'!$R$14)^A12),9) * 2,ROUND(1/((1+'CrediAltoque (SI)'!$R$14)^A12),9)))","v":0.63167897500000003},7.0335077069999992]
[10,10,"2023-12-15",12,{"$f":"IF(ISERROR(MATCH(D13,'CrediAltoque (SI)'!$H$18:$H$19,0))=FALSE,\"C\",IF(ISERROR(MATCH(D13,'CrediAltoque (SI)'!$H$20:$H$21,0))=FALSE,\"D\",\"\"))","v":""},{"$f":"IF(E13=\"C\",0,IF(E13 =\"D\",ROUND(1/((1+'CrediAltoque (SI)'!$R$14)^A13),9) * 2,ROUND(1/((1+'CrediAltoque (SI)'!$R$14)^A13),9)))","v":0.60024611500000002},7.6337538219999992]
[11,11,"2024-01-15",1,{"$f":"IF(ISERROR(MATCH(D14,'CrediAltoque (SI)'!$H$18:$H$19,0))=FALSE,\"C\",IF(ISERROR(MATCH(D14,'CrediAltoque (SI)'!$H$20:$H$21,0))=FALSE,\"D\",\"\"))","v":""},{"$f":"IF(E14=\"C\",0,IF(E14 =\"D\",ROUND(1/((1+'CrediAltoque (SI)'!$R$14)^A14),9) * 2,ROUND(1/((1+'CrediAltoque (SI)'!$R$14)^A14),9)))","v":0.57037737899999996},8.2041312009999992]
[12,12,"2024-02-15",2,{"$f":"IF(ISERROR(MATCH(D15,'CrediAltoque (SI)'!$H$18:$H$19,0))=FALSE,\"C\",IF(ISERROR(MATCH(D15,'CrediAltoque (SI)'!$H$20:$H$21,0))=FALSE,\"D\",\"\"))","v":""},{"$f":"IF(E15=\"C\",0,IF(E15 =\"D\",ROUND(1/((1+'CrediAltoque (SI)'!$R$14)^A15),9) * 2,ROUND(1/((1+'CrediAltoque (SI)'!$R$14)^A15),9)))","v":0.54199493600000004},8.7461261369999992]
[13,13,"2024-03-15",3,{"$f":"IF(ISERROR(MATCH(D16,'CrediAltoque (SI)'!$H$18:$H$19,0))=FALSE,\"C\",IF(ISERROR(MATCH(D16,'CrediAltoque (SI)'!$H$20:$H$21,0))=FALSE,\"D\",\"\"))","v":""},{"$f":"IF(E16=\"C\",0,IF(E16 =\"D\",ROUND(1/((1+'CrediAltoque (SI)'!$R$14)^A16),9) * 2,ROUND(1/((1+'CrediAltoque (SI)'!$R$14)^A16),9)))","v":0.51502482699999996},9.2611509639999987]
[14,14,"2024-04-15",4,{"$f":"IF(ISERROR(MATCH(D17,'CrediAltoque (SI)'!$H$18:$H$19,0))=FALSE,\"C\",IF(ISERROR(MATCH(D17,'CrediAltoque (SI)'!$H$20:$H$21,0))=FALSE,\"D\",\"\"))","v":""},{"$f":"IF(E17=\"C\",0,IF(E17 =\"D\",ROUND(1/((1+'CrediAltoque (SI)'!$R$14)^A17),9) * 2,ROUND(1/((1+'CrediAltoque (SI)'!$R$14)^A17),9)))","v":0.48939677199999998},9.7505477359999979]
[15,15,"2024-05-15",5,{"$f":"IF(ISERROR(MATCH(D18,'CrediAltoque (SI)'!$H$18:$H$19,0))=FALSE,\"C\",IF(ISERROR(MATCH(D18,'CrediAltoque (SI)'!$H$20:$H$21,0))=FALSE,\"D\",\"\"))","v":""},{"$f":"IF(E18=\"C\",0,IF(E18 =\"D\",ROUND(1/((1+'CrediAltoque (SI)'!$R$14)^A18),9) * 2,ROUND(1/((1+'CrediAltoque (SI)'!$R$14)^A18),9)))","v":0.46504399000000002},10.215591725999998]
[16,16,"2024-06-15",6,{"$f":"IF(ISERROR(MATCH(D19,'CrediAltoque (SI)'!$H$18:$H$19,0))=FALSE,\"C\",IF(ISERROR(MATCH(D19,'CrediAltoque (SI)'!$H$20:$H$21,0))=FALSE,\"D\",\"\"))","v":""},{"$f":"IF(E19=\"C\",0,IF(E19 =\"D\",ROUND(1/((1+'CrediAltoque (SI)'!$R$14)^A19),9) * 2,ROUND(1/((1+'CrediAltoque (SI)'!$R$14)^A19),9)))","v":0.44190302199999998},10.657494747999998]
[17,17,"2024-07-15",7,{"$f":"IF(ISERROR(MATCH(D20,'CrediAltoque (SI)'!$H$18:$H$19,0))=FALSE,\"C\",IF(ISERROR(MATCH(D20,'CrediAltoque (SI)'!$H$20:$H$21,0))=FALSE,\"D\",\"\"))","v":""},{"$f":"IF(E20=\"C\",0,IF(E20 =\"D\",ROUND(1/((1+'CrediAltoque (SI)'!$R$14)^A20),9) * 2,ROUND(1/((1+'CrediAltoque (SI)'!$R$14)^A20),9)))","v":0.41991356800000001},11.077408315999998]
[18,18,"2024-08-15",8,{"$f":"IF(ISERROR(MATCH(D21,'CrediAltoque (SI)'!$H$18:$H$19,0))=FALSE,\"C\",IF(ISERROR(MATCH(D21,'CrediAltoque (SI)'!$H$20:$H$21,0))=FALSE,\"D\",\"\"))","v":""},{"$f":"IF(E21=\"C\",0,IF(E21 =\"D\",ROUND(1/((1+'CrediAltoque (SI)'!$R$14)^A21),9) * 2,ROUND(1/((1+'CrediAltoque (SI)'!$R$14)^A21),9)))","v":0.39901832700000001},11.476426642999998]
[19,19,"2024-09-15",9,{"$f":"IF(ISERROR(MATCH(D22,'CrediAltoque (SI)'!$H$18:$H$19,0))=FALSE,\"C\",IF(ISERROR(MATCH(D22,'CrediAltoque (SI)'!$H$20:$H$21,0))=FALSE,\"D\",\"\"))","v":""},{"$f":"IF(E22=\"C\",0,IF(E22 =\"D\",ROUND(1/((1+'CrediAltoque (SI)'!$R$14)^A22),9) * 2,ROUND(1/((1+'CrediAltoque (SI)'!$R$14)^A22),9)))","v":0.37916285},11.855589492999998]
[20,20,"2024-10-15",10,{"$f":"IF(ISERROR(MATCH(D23,'CrediAltoque (SI)'!$H$18:$H$19,0))=FALSE,\"C\",IF(ISERROR(MATCH(D23,'CrediAltoque (SI)'!$H$20:$H$21,0))=FALSE,\"D\",\"\"))","v":""},{"$f":"IF(E23=\"C\",0,IF(E23 =\"D\",ROUND(1/((1+'CrediAltoque (SI)'!$R$14)^A23),9) * 2,ROUND(1/((1+'CrediAltoque (SI)'!$R$14)^A23),9)))","v":0.36029539799999999},12.215884890999998]
[21,21,"2024-11-15",11,{"$f":"IF(ISERROR(MATCH(D24,'CrediAltoque (SI)'!$H$18:$H$19,0))=FALSE,\"C\",IF(ISERROR(MATCH(D24,'CrediAltoque (SI)'!$H$20:$H$21,0))=FALSE,\"D\",\"\"))","v":""},{"$f":"IF(E24=\"C\",0,IF(E24 =\"D\",ROUND(1/((1+'CrediAltoque (SI)'!$R$14)^A24),9) * 2,ROUND(1/((1+'CrediAltoque (SI)'!$R$14)^A24),9)))","v":0.34236680600000002},12.558251696999998]
[22,22,"2024-12-15",12,{"$f":"IF(ISERROR(MATCH(D25,'CrediAltoque (SI)'!$H$18:$H$19,0))=FALSE,\"C\",IF(ISERROR(MATCH(D25,'CrediAltoque (SI)'!$H$20:$H$21,0))=FALSE,\"D\",\"\"))","v":""},{"$f":"IF(E25=\"C\",0,IF(E25 =\"D\",ROUND(1/((1+'CrediAltoque (SI)'!$R$14)^A25),9) * 2,ROUND(1/((1+'CrediAltoque (SI)'!$R$14)^A25),9)))","v":0.32533035500000002},12.883582051999998]
[23,23,"2025-01-15",1,{"$f":"IF(ISERROR(MATCH(D26,'CrediAltoque (SI)'!$H$18:$H$19,0))=FALSE,\"C\",IF(ISERROR(MATCH(D26,'CrediAltoque (SI)'!$H$20:$H$21,0))=FALSE,\"D\",\"\"))","v":""},{"$f":"IF(E26=\"C\",0,IF(E26 =\"D\",ROUND(1/((1+'CrediAltoque (SI)'!$R$14)^A26),9) * 2,ROUND(1/((1+'CrediAltoque (SI)'!$R$14)^A26),9)))","v":0.30914165100000002},13.192723702999999]
[24,24,"2025-02-15",2,{"$f":"IF(ISERROR(MATCH(D27,'CrediAltoque (SI)'!$H$18:$H$19,0))=FALSE,\"C\",IF(ISERROR(MATCH(D27,'CrediAltoque (SI)'!$H$20:$H$21,0))=FALSE,\"D\",\"\"))","v":""},{"$f":"IF(E27=\"C\",0,IF(E27 =\"D\",ROUND(1/((1+'CrediAltoque (SI)'!$R$14)^A27),9) * 2,ROUND(1/((1+'CrediAltoque (SI)'!$R$14)^A27),9)))","v":0.293758511},13.486482213999999]
[25,25,"2025-03-15",3,{"$f":"IF(ISERROR(MATCH(D28,'CrediAltoque (SI)'!$H$18:$H$19,0))=FALSE,\"C\",IF(ISERROR(MATCH(D28,'CrediAltoque (SI)'!$H$20:$H$21,0))=FALSE,\"D\",\"\"))","v":""},{"$f":"IF(E28=\"C\",0,IF(E28 =\"D\",ROUND(1/((1+'CrediAltoque (SI)'!$R$14)^A28),9) * 2,ROUND(1/((1+'CrediAltoque (SI)'!$R$14)^A28),9)))","v":0.279140848},13.765623062]
[26,26,"2025-04-15",4,{"$f":"IF(ISERROR(MATCH(D29,'CrediAltoque (SI)'!$H$18:$H$19,0))=FALSE,\"C\",IF(ISERROR(MATCH(D29,'CrediAltoque (SI)'!$H$20:$H$21,0))=FALSE,\"D\",\"\"))","v":""},{"$f":"IF(E29=\"C\",0,IF(E29 =\"D\",ROUND(1/((1+'CrediAltoque (SI)'!$R$14)^A29),9) * 2,ROUND(1/((1+'CrediAltoque (SI)'!$R$14)^A29),9)))","v":0.26525057200000002},14.030873633999999]
[27,27,"2025-05-15",5,{"$f":"IF(ISERROR(MATCH(D30,'CrediAltoque (SI)'!$H$18:$H$19,0))=FALSE,\"C\",IF(ISERROR(MATCH(D30,'CrediAltoque (SI)'!$H$20:$H$21,0))=FALSE,\"D\",\"\"))","v":""},{"$f":"IF(E30=\"C\",0,IF(E30 =\"D\",ROUND(1/((1+'CrediAltoque (SI)'!$R$14)^A30),9) * 2,ROUND(1/((1+'CrediAltoque (SI)'!$R$14)^A30),9)))","v":0.25205148799999999},14.282925121999998]
{"$rows_left_out":356}