{"text_format":"1","workbook":"xlsx","n_sheets":3,"sheets":["v1-mascara"," v2-calculos","v3-cronograma"],"not_rendered":{"charts":0,"images":2,"macros":1,"external_links":1,"defined_names":0,"comments":1,"pivot_tables":0},"unopened":[],"bounds":{"document_bytes":16777216,"sheet_cells":100000,"rows_first":2000,"rows_last":500,"rows_between":2000,"halvings":0,"cell_chars":16384,"cell_head_chars":4096},"cells_cut":0,"cells_raw":0,"read":"whole","date_system":"1900"}

{"sheet":"v1-mascara","index":0,"n_rows":19,"n_cols":9,"rows_kept":19,"cut":false,"hidden":false,"merged":[[4,6,4,8],[18,6,18,8],[16,6,16,8],[14,6,14,8],[12,6,12,8],[10,6,10,8],[6,6,6,8]]}
[]
[null,null,"Simulador Crédito Por Convenio"]
[]
[]
[null,null,"Moneda",null,null,null,"PEN"]
[]
[null,null,"Monto Prestamo",null,null,null,78450]
[]
[null,null,"Fecha Desembolso",null,null,null,1,2,2022]
[]
[null,null,"Plazo (meses)",null,null,null,72]
[]
[null,null,"TEA",null,null,null,10]
[]
[null,null,"Descuento automatico por planilla",null,null,null,3]
[]
[null,null,"Uso casillero",null,null,null,2]
[]
[null,null,"Seguro Desgravamen",null,null,null,8.9999999999999998E-4]

{"sheet":" v2-calculos","index":1,"n_rows":127,"n_cols":27,"rows_kept":127,"cut":false,"hidden":false,"merged":[[1,1,1,17]]}
[]
[null,"SIMULADOR DE CUOTAS - CRÉDITO CONVENIOS"]
[]
[]
[null,"Importe Solicitado",null,null,null,{"$f":"'v1-mascara'!G7","v":78450},null,null,null,"Fecha Desembolso",null,null,null,null,{"$f":"DATE('v1-mascara'!I9,'v1-mascara'!H8,'v1-mascara'!G9)","v":"2021-12-01"},null,"F_venc",2,"Plazo_1"]
[null,"Saldo de Capital",null,null,null,{"$f":"F5","v":78450},null,null,null,"Fecha Final de Gracia",null,null,null,null,{"$f":"DATE(YEAR(EDATE(O5,R6)),MONTH(EDATE(O5,R6)),R5)","v":"2022-01-02"},null,"P_gracia",1]
[null,"Saldo de Interes",null,null,null,0,null,null,null,"Fecha de la 1° cuota",null,null,null,null,{"$f":"DATE(YEAR(EDATE(O6,1)),MONTH(EDATE(O6,1)),R5)","v":"2022-02-02"},null,"dia corte",30]
[null,"Tasa Anual (TEA)",null,null,null,{"$f":"'v1-mascara'!G13","v":10},"Tasa de Gracia",0,null,"Fecha final de vencimiento",null,null,null,null,{"$f":"DATE(YEAR(EDATE(O6,F13)),MONTH(EDATE(O6,F13)),DAY(EDATE(O6,F13)))","v":"2028-01-02"}]
[null,"Tasa de Seguro de Desgravámen",null,null,null,{"$f":"'v1-mascara'!G19:I19","v":8.9999999999999998E-4},0,0,null,"Base",null,null,null,null,360]
[null,null,null,null,null,null,null,null,null,"Frecuencia pago en días",null,null,null,null,30]
[null,"Comisiones + Pago Casillero",null,null,null,{"$f":"'v1-mascara'!G17+'v1-mascara'!G15","v":5},null,null,null,"Tasa Equivalente",null,null,null,null,{"$f":"ROUND((((F8/100+1)^(1/(O9/O10))-1)*O9/O10)*100,6)","v":9.5689689999999992},"tea conv. A tem luego nominal anual"]
[null,null,null,null,null,null,null,null,null,"Días entre cuotas",null,null,null,null,{"$f":"(O8-O6)/F13","v":30.430555555555557},"dias promedio entre cuotas"]
[null,"Plazo y  Nro. Cuotas",null,null,null,{"$f":"'v1-mascara'!G11","v":72},{"$f":"IF(F16+ F17>0,VLOOKUP(F13,[1]Calculos!$A$3:$B$99,2,FALSE),F13)","v":72},null,null,"Factor Aplicado",null,null,null,null,{"$f":"($O$11/100)/($O$9/$O$12)","v":8.0885845212191349E-3},"tem convertida de manera nominal a los dias entre cuotas"]
[null,"Días de Gracia",null,null,null,{"$f":"O6-O5","v":32},null,null,null,"Factor Aplicado para la cuota",null,null,null,null,{"$f":"1/((1-((1+$O$13)^(-1*$F$13)))/$O$13)","v":1.8378073668470728E-2},"Factor de cuota (ok)"]
[null,"(+/- 30 días antes de la fecha 1° cuota)",null,null,null,null,null,null,null,"Interes de Gracia ",null,null,null,null,{"$f":"IF(F14>0,ROUND(F6*(((1+F8/100)^(ABS(F14)/O9))-1),4),ROUND(F6*(((1+F8/100)^(ABS(F14)/O9))-1),4) * -1)","v":667.45299999999997},"Ok"]
[null,"Mes de No Pago 1",null,null,null,0,null,null,null,"Saldo Interes +/- Interes Gracia",null,null,null,null,{"$f":"IF(F7 + O15>0,F7+ O15,0)","v":667.45299999999997}]
[null,"Mes de No Pago 2",null,null,null,0]
[null,"Mes Cuota Doble 1",null,null,null,0,null,null,null,"Comisión de Gracia Desgravamen (Primera Cuota)",null,null,null,null,{"$f":"IF(F14>0,ROUNDDOWN(F5 * F9/30*F14,2),0)","v":75.31}]
[null,"Mes Cuota Doble 2",null,null," ",0]
[null,null,null,null,null,null,null,"=REDONDEAR(SI(O(F16+ F17> 0,F18 + F19>0),REDONDEAR.MAS(O16/BUSCARV(F13,Calculos!$A$3:$G$99,7,FALSO),2),O16*$O$14),2)"]
[]
[null,null,null,null,null,null,null,"Con Factor","Con Minicronograma",null,"Suavización",null,"Ultimo saldo de Principal",null,{"$f":"VLOOKUP(G13,$D$31:$Q$91,14,FALSE) - VLOOKUP(G13,$D$31:$S$91,16,FALSE)","v":{"$error":"#N/A"}}]
[null,null,null,null,"Valor de cuota por dias de gracia",null,null,{"$f":"$O$16/($G$13*(1/((1+0)^($O$10/$O$9))))","v":9.2701805555555552},{"$f":"O16/SUM(V32:INDIRECT(CONCATENATE(\"V\",32+G13-1)))","v":11.124216666666666},null,null,null,"Numero de Dias",null,{"$f":"O8-O6","v":2191}]
[null,null,null,null,"Valor de cuota por capital",null,null,{"$f":"ROUND(IF(OR(F16 + F17 > 0,F18 + F19>0), ROUNDUP(F6/VLOOKUP(F13,[1]Calculos!$A$3:$G$99,7,FALSE),2),F6*$O$14),2)","v":1441.76},"Promedio","Exceso Desgravamen",null,null,"Valor de Cuota Nivelada",null,{"$f":"ROUND(+O22/ROUND(1*(((1+F8/100)^(O23/O9))-1),4),2)","v":{"$error":"#N/A"}}]
[null,null,null,null,"Seguro de Desgravamen (FPF)",null,null,{"$f":"ROUNDDOWN($F$5*$F$9,2)","v":70.599999999999994},{"$f":"((H25*F13) + O18)/F13","v":71.645972222222227},{"$f":"I25-H25","v":1.0459722222222325},null,null,"Factor Ajuste",null,{"$f":"O24*O14","v":{"$error":"#N/A"}},null,"Se copia el valor de la celda P26 solo en  la primera corrida, siempre que sea mayor a cero"]
[null,null,null,null,"Comisiones + Pago de Casillero",null,null,{"$f":"$F$11","v":5},null,null,null,null,"Exceso de Int + Gracia",null,{"$f":"SUM(R32:R46)","v":0},{"$f":"ROUND(IF(F16+ F17> 0,ROUNDUP($O$26/VLOOKUP(F13,[1]Calculos!$A$3:$G$99,7,FALSE),2),$O$26*$O$14),2)","v":0},0]
[]
[null,null,null,null,"Cuota",null,null,{"$f":"H23+H24+H25+H26","v":1526.6301805555554},{"$f":"H23+H24+I25+H26","v":1527.6761527777778},null,null,null,"Digite Factor de Ajuste Anterior mas El Actual",null,0.84,null,null,"=-8.79+8.16-7.57+7.03-6.53+6.06-5.63+5.23-4.85+4.5-4.18+3.88-3.6+3.35-3.12+2.9-2.7+2.51-2.33+2.16-2+1.86-1.73+1.61-1.5+1.39-1.29+1.2-1.11+1.03-0.96+0.89-0.82+0.76-0.71+0.66-0.61+0.56-0.52+0.49-0.46+0.43-0.4+0.37-0.34+0.31-0.29+0.28-0.27+0.26-0.25+0.24-0.23+0.22-0.21+0.19-0.17+0.16-0.15+0.14-0.13+0.12-0.11+0.1-0.09+0.09-0.09"]
[]
[null,null,null,null,null,null,null,null,{"$f":"SUM(I32:I127)","v":78449.999999999985},25370.859999999986,667.45299999999907,26038.312999999995,104488.3130000001,360,{"$f":"SUM(O32:O127)","v":5158.510000000002}]
{"$rows_left_out":98}
{"sheet":"v3-cronograma","index":2,"n_rows":86,"n_cols":10,"rows_kept":86,"cut":false,"hidden":false,"merged":[[10,7,10,8],[3,3,3,9]]}
[]
[]
[]
[null,null,null,"CRONOGRAMA DE PAGOS - Credito Por Convenios"]
[]
[]
[null,null,null,"Moneda",{"$f":"'v1-mascara'!G5","v":"PEN"},null,null,"Monto prestamo",null,{"$f":"'v1-mascara'!G7","v":78450}]
[null,null,null,"Producto","Convenios",null,null,"TEA",null,{"$f":"'v1-mascara'!G13","v":10}]
[null,null,null,"Fecha desembolso",{"$f":"' v2-calculos'!O5","v":"2021-12-01"},null,null,"Plazo",null,{"$f":"'v1-mascara'!G11","v":72}]
[null,null,null,"Periodo de gracia",{"$f":"' v2-calculos'!F14","v":32},null,null,"TCEA"]
[null,null,null,null,null,null,null,"Tasa Seguro Desgravamen",null,{"$f":"'v1-mascara'!G19","v":8.9999999999999998E-4}]
[]
[]
[null,null,null,"Principal","Capital","Interes","Interes de Gracia","Comisiones","Seguro de Desgravamen","Cuota"]
[null,null,1,{"$f":"INDEX(' v2-calculos'!$H$31:$H$127,MATCH(C15,' v2-calculos'!$D$31:$D$127,0),1)","v":78450},{"$f":"INDEX(' v2-calculos'!$I$31:$I$127,MATCH(C15,' v2-calculos'!$D$31:$D$127,0),1)","v":720.78},{"$f":"INDEX(' v2-calculos'!$J$31:$J$127,MATCH(C15,' v2-calculos'!$D$31:$D$127,0),1)","v":646.51},{"$f":"INDEX(' v2-calculos'!$K$31:$K$127,MATCH(C15,' v2-calculos'!$D$31:$D$127,0),1)","v":9.2701805555555552},{"$f":"INDEX(' v2-calculos'!$N$31:$N$127,MATCH(C15,' v2-calculos'!$D$31:$D$127,0),1)","v":5},{"$f":"INDEX(' v2-calculos'!$O$31:$O$127,MATCH(C15,' v2-calculos'!$D$31:$D$127,0),1)","v":145.91},{"$f":"INDEX(' v2-calculos'!$P$31:$P$127,MATCH(C15,' v2-calculos'!$D$31:$D$127,0),1)","v":1527.4701805555555}]
[null,null,{"$f":"C15+1","v":2},{"$f":"INDEX(' v2-calculos'!$H$31:$H$127,MATCH(C16,' v2-calculos'!$D$31:$D$127,0),1)","v":77729.22},{"$f":"INDEX(' v2-calculos'!$I$31:$I$127,MATCH(C16,' v2-calculos'!$D$31:$D$127,0),1)","v":864.24999999999989},{"$f":"INDEX(' v2-calculos'!$J$31:$J$127,MATCH(C16,' v2-calculos'!$D$31:$D$127,0),1)","v":578.35},{"$f":"INDEX(' v2-calculos'!$K$31:$K$127,MATCH(C16,' v2-calculos'!$D$31:$D$127,0),1)","v":9.2701805555555552},{"$f":"INDEX(' v2-calculos'!$N$31:$N$127,MATCH(C16,' v2-calculos'!$D$31:$D$127,0),1)","v":5},{"$f":"INDEX(' v2-calculos'!$O$31:$O$127,MATCH(C16,' v2-calculos'!$D$31:$D$127,0),1)","v":70.599999999999994},{"$f":"INDEX(' v2-calculos'!$P$31:$P$127,MATCH(C16,' v2-calculos'!$D$31:$D$127,0),1)","v":1527.4701805555553}]
[null,null,{"$f":"C16+1","v":3},{"$f":"INDEX(' v2-calculos'!$H$31:$H$127,MATCH(C17,' v2-calculos'!$D$31:$D$127,0),1)","v":76864.97},{"$f":"INDEX(' v2-calculos'!$I$31:$I$127,MATCH(C17,' v2-calculos'!$D$31:$D$127,0),1)","v":809.14999999999986},{"$f":"INDEX(' v2-calculos'!$J$31:$J$127,MATCH(C17,' v2-calculos'!$D$31:$D$127,0),1)","v":633.45000000000005},{"$f":"INDEX(' v2-calculos'!$K$31:$K$127,MATCH(C17,' v2-calculos'!$D$31:$D$127,0),1)","v":9.2701805555555552},{"$f":"INDEX(' v2-calculos'!$N$31:$N$127,MATCH(C17,' v2-calculos'!$D$31:$D$127,0),1)","v":5},{"$f":"INDEX(' v2-calculos'!$O$31:$O$127,MATCH(C17,' v2-calculos'!$D$31:$D$127,0),1)","v":70.599999999999994},{"$f":"INDEX(' v2-calculos'!$P$31:$P$127,MATCH(C17,' v2-calculos'!$D$31:$D$127,0),1)","v":1527.4701805555553}]
[null,null,4,{"$f":"INDEX(' v2-calculos'!$H$31:$H$127,MATCH(C18,' v2-calculos'!$D$31:$D$127,0),1)","v":76055.820000000007},{"$f":"INDEX(' v2-calculos'!$I$31:$I$127,MATCH(C18,' v2-calculos'!$D$31:$D$127,0),1)","v":836.11999999999989},{"$f":"INDEX(' v2-calculos'!$J$31:$J$127,MATCH(C18,' v2-calculos'!$D$31:$D$127,0),1)","v":606.48},{"$f":"INDEX(' v2-calculos'!$K$31:$K$127,MATCH(C18,' v2-calculos'!$D$31:$D$127,0),1)","v":9.2701805555555552},{"$f":"INDEX(' v2-calculos'!$N$31:$N$127,MATCH(C18,' v2-calculos'!$D$31:$D$127,0),1)","v":5},{"$f":"INDEX(' v2-calculos'!$O$31:$O$127,MATCH(C18,' v2-calculos'!$D$31:$D$127,0),1)","v":70.599999999999994},{"$f":"INDEX(' v2-calculos'!$P$31:$P$127,MATCH(C18,' v2-calculos'!$D$31:$D$127,0),1)","v":1527.4701805555553}]
[null,null,5,{"$f":"INDEX(' v2-calculos'!$H$31:$H$127,MATCH(C19,' v2-calculos'!$D$31:$D$127,0),1)","v":75219.7},{"$f":"INDEX(' v2-calculos'!$I$31:$I$127,MATCH(C19,' v2-calculos'!$D$31:$D$127,0),1)","v":822.70999999999992},{"$f":"INDEX(' v2-calculos'!$J$31:$J$127,MATCH(C19,' v2-calculos'!$D$31:$D$127,0),1)","v":619.89},{"$f":"INDEX(' v2-calculos'!$K$31:$K$127,MATCH(C19,' v2-calculos'!$D$31:$D$127,0),1)","v":9.2701805555555552},{"$f":"INDEX(' v2-calculos'!$N$31:$N$127,MATCH(C19,' v2-calculos'!$D$31:$D$127,0),1)","v":5},{"$f":"INDEX(' v2-calculos'!$O$31:$O$127,MATCH(C19,' v2-calculos'!$D$31:$D$127,0),1)","v":70.599999999999994},{"$f":"INDEX(' v2-calculos'!$P$31:$P$127,MATCH(C19,' v2-calculos'!$D$31:$D$127,0),1)","v":1527.4701805555553}]
[null,null,6,{"$f":"INDEX(' v2-calculos'!$H$31:$H$127,MATCH(C20,' v2-calculos'!$D$31:$D$127,0),1)","v":74396.990000000005},{"$f":"INDEX(' v2-calculos'!$I$31:$I$127,MATCH(C20,' v2-calculos'!$D$31:$D$127,0),1)","v":849.34999999999991},{"$f":"INDEX(' v2-calculos'!$J$31:$J$127,MATCH(C20,' v2-calculos'!$D$31:$D$127,0),1)","v":593.25},{"$f":"INDEX(' v2-calculos'!$K$31:$K$127,MATCH(C20,' v2-calculos'!$D$31:$D$127,0),1)","v":9.2701805555555552},{"$f":"INDEX(' v2-calculos'!$N$31:$N$127,MATCH(C20,' v2-calculos'!$D$31:$D$127,0),1)","v":5},{"$f":"INDEX(' v2-calculos'!$O$31:$O$127,MATCH(C20,' v2-calculos'!$D$31:$D$127,0),1)","v":70.599999999999994},{"$f":"INDEX(' v2-calculos'!$P$31:$P$127,MATCH(C20,' v2-calculos'!$D$31:$D$127,0),1)","v":1527.4701805555553}]
[null,null,7,{"$f":"INDEX(' v2-calculos'!$H$31:$H$127,MATCH(C21,' v2-calculos'!$D$31:$D$127,0),1)","v":73547.64},{"$f":"INDEX(' v2-calculos'!$I$31:$I$127,MATCH(C21,' v2-calculos'!$D$31:$D$127,0),1)","v":836.4899999999999},{"$f":"INDEX(' v2-calculos'!$J$31:$J$127,MATCH(C21,' v2-calculos'!$D$31:$D$127,0),1)","v":606.11},{"$f":"INDEX(' v2-calculos'!$K$31:$K$127,MATCH(C21,' v2-calculos'!$D$31:$D$127,0),1)","v":9.2701805555555552},{"$f":"INDEX(' v2-calculos'!$N$31:$N$127,MATCH(C21,' v2-calculos'!$D$31:$D$127,0),1)","v":5},{"$f":"INDEX(' v2-calculos'!$O$31:$O$127,MATCH(C21,' v2-calculos'!$D$31:$D$127,0),1)","v":70.599999999999994},{"$f":"INDEX(' v2-calculos'!$P$31:$P$127,MATCH(C21,' v2-calculos'!$D$31:$D$127,0),1)","v":1527.4701805555553}]
[null,null,8,{"$f":"INDEX(' v2-calculos'!$H$31:$H$127,MATCH(C22,' v2-calculos'!$D$31:$D$127,0),1)","v":72711.149999999994},{"$f":"INDEX(' v2-calculos'!$I$31:$I$127,MATCH(C22,' v2-calculos'!$D$31:$D$127,0),1)","v":843.37999999999988},{"$f":"INDEX(' v2-calculos'!$J$31:$J$127,MATCH(C22,' v2-calculos'!$D$31:$D$127,0),1)","v":599.22},{"$f":"INDEX(' v2-calculos'!$K$31:$K$127,MATCH(C22,' v2-calculos'!$D$31:$D$127,0),1)","v":9.2701805555555552},{"$f":"INDEX(' v2-calculos'!$N$31:$N$127,MATCH(C22,' v2-calculos'!$D$31:$D$127,0),1)","v":5},{"$f":"INDEX(' v2-calculos'!$O$31:$O$127,MATCH(C22,' v2-calculos'!$D$31:$D$127,0),1)","v":70.599999999999994},{"$f":"INDEX(' v2-calculos'!$P$31:$P$127,MATCH(C22,' v2-calculos'!$D$31:$D$127,0),1)","v":1527.4701805555553}]
[null,null,9,{"$f":"INDEX(' v2-calculos'!$H$31:$H$127,MATCH(C23,' v2-calculos'!$D$31:$D$127,0),1)","v":71867.77},{"$f":"INDEX(' v2-calculos'!$I$31:$I$127,MATCH(C23,' v2-calculos'!$D$31:$D$127,0),1)","v":869.51999999999987},{"$f":"INDEX(' v2-calculos'!$J$31:$J$127,MATCH(C23,' v2-calculos'!$D$31:$D$127,0),1)","v":573.08000000000004},{"$f":"INDEX(' v2-calculos'!$K$31:$K$127,MATCH(C23,' v2-calculos'!$D$31:$D$127,0),1)","v":9.2701805555555552},{"$f":"INDEX(' v2-calculos'!$N$31:$N$127,MATCH(C23,' v2-calculos'!$D$31:$D$127,0),1)","v":5},{"$f":"INDEX(' v2-calculos'!$O$31:$O$127,MATCH(C23,' v2-calculos'!$D$31:$D$127,0),1)","v":70.599999999999994},{"$f":"INDEX(' v2-calculos'!$P$31:$P$127,MATCH(C23,' v2-calculos'!$D$31:$D$127,0),1)","v":1527.4701805555553}]
[null,null,10,{"$f":"INDEX(' v2-calculos'!$H$31:$H$127,MATCH(C24,' v2-calculos'!$D$31:$D$127,0),1)","v":70998.25},{"$f":"INDEX(' v2-calculos'!$I$31:$I$127,MATCH(C24,' v2-calculos'!$D$31:$D$127,0),1)","v":857.49999999999989},{"$f":"INDEX(' v2-calculos'!$J$31:$J$127,MATCH(C24,' v2-calculos'!$D$31:$D$127,0),1)","v":585.1},{"$f":"INDEX(' v2-calculos'!$K$31:$K$127,MATCH(C24,' v2-calculos'!$D$31:$D$127,0),1)","v":9.2701805555555552},{"$f":"INDEX(' v2-calculos'!$N$31:$N$127,MATCH(C24,' v2-calculos'!$D$31:$D$127,0),1)","v":5},{"$f":"INDEX(' v2-calculos'!$O$31:$O$127,MATCH(C24,' v2-calculos'!$D$31:$D$127,0),1)","v":70.599999999999994},{"$f":"INDEX(' v2-calculos'!$P$31:$P$127,MATCH(C24,' v2-calculos'!$D$31:$D$127,0),1)","v":1527.4701805555553}]
[null,null,11,{"$f":"INDEX(' v2-calculos'!$H$31:$H$127,MATCH(C25,' v2-calculos'!$D$31:$D$127,0),1)","v":70140.75},{"$f":"INDEX(' v2-calculos'!$I$31:$I$127,MATCH(C25,' v2-calculos'!$D$31:$D$127,0),1)","v":883.29},{"$f":"INDEX(' v2-calculos'!$J$31:$J$127,MATCH(C25,' v2-calculos'!$D$31:$D$127,0),1)","v":559.30999999999995},{"$f":"INDEX(' v2-calculos'!$K$31:$K$127,MATCH(C25,' v2-calculos'!$D$31:$D$127,0),1)","v":9.2701805555555552},{"$f":"INDEX(' v2-calculos'!$N$31:$N$127,MATCH(C25,' v2-calculos'!$D$31:$D$127,0),1)","v":5},{"$f":"INDEX(' v2-calculos'!$O$31:$O$127,MATCH(C25,' v2-calculos'!$D$31:$D$127,0),1)","v":70.599999999999994},{"$f":"INDEX(' v2-calculos'!$P$31:$P$127,MATCH(C25,' v2-calculos'!$D$31:$D$127,0),1)","v":1527.4701805555553}]
[null,null,12,{"$f":"INDEX(' v2-calculos'!$H$31:$H$127,MATCH(C26,' v2-calculos'!$D$31:$D$127,0),1)","v":69257.460000000006},{"$f":"INDEX(' v2-calculos'!$I$31:$I$127,MATCH(C26,' v2-calculos'!$D$31:$D$127,0),1)","v":871.84999999999991},{"$f":"INDEX(' v2-calculos'!$J$31:$J$127,MATCH(C26,' v2-calculos'!$D$31:$D$127,0),1)","v":570.75},{"$f":"INDEX(' v2-calculos'!$K$31:$K$127,MATCH(C26,' v2-calculos'!$D$31:$D$127,0),1)","v":9.2701805555555552},{"$f":"INDEX(' v2-calculos'!$N$31:$N$127,MATCH(C26,' v2-calculos'!$D$31:$D$127,0),1)","v":5},{"$f":"INDEX(' v2-calculos'!$O$31:$O$127,MATCH(C26,' v2-calculos'!$D$31:$D$127,0),1)","v":70.599999999999994},{"$f":"INDEX(' v2-calculos'!$P$31:$P$127,MATCH(C26,' v2-calculos'!$D$31:$D$127,0),1)","v":1527.4701805555553}]
[null,null,13,{"$f":"INDEX(' v2-calculos'!$H$31:$H$127,MATCH(C27,' v2-calculos'!$D$31:$D$127,0),1)","v":68385.61},{"$f":"INDEX(' v2-calculos'!$I$31:$I$127,MATCH(C27,' v2-calculos'!$D$31:$D$127,0),1)","v":879.02999999999986},{"$f":"INDEX(' v2-calculos'!$J$31:$J$127,MATCH(C27,' v2-calculos'!$D$31:$D$127,0),1)","v":563.57000000000005},{"$f":"INDEX(' v2-calculos'!$K$31:$K$127,MATCH(C27,' v2-calculos'!$D$31:$D$127,0),1)","v":9.2701805555555552},{"$f":"INDEX(' v2-calculos'!$N$31:$N$127,MATCH(C27,' v2-calculos'!$D$31:$D$127,0),1)","v":5},{"$f":"INDEX(' v2-calculos'!$O$31:$O$127,MATCH(C27,' v2-calculos'!$D$31:$D$127,0),1)","v":70.599999999999994},{"$f":"INDEX(' v2-calculos'!$P$31:$P$127,MATCH(C27,' v2-calculos'!$D$31:$D$127,0),1)","v":1527.4701805555553}]
[null,null,14,{"$f":"INDEX(' v2-calculos'!$H$31:$H$127,MATCH(C28,' v2-calculos'!$D$31:$D$127,0),1)","v":67506.58},{"$f":"INDEX(' v2-calculos'!$I$31:$I$127,MATCH(C28,' v2-calculos'!$D$31:$D$127,0),1)","v":940.31},{"$f":"INDEX(' v2-calculos'!$J$31:$J$127,MATCH(C28,' v2-calculos'!$D$31:$D$127,0),1)","v":502.29},{"$f":"INDEX(' v2-calculos'!$K$31:$K$127,MATCH(C28,' v2-calculos'!$D$31:$D$127,0),1)","v":9.2701805555555552},{"$f":"INDEX(' v2-calculos'!$N$31:$N$127,MATCH(C28,' v2-calculos'!$D$31:$D$127,0),1)","v":5},{"$f":"INDEX(' v2-calculos'!$O$31:$O$127,MATCH(C28,' v2-calculos'!$D$31:$D$127,0),1)","v":70.599999999999994},{"$f":"INDEX(' v2-calculos'!$P$31:$P$127,MATCH(C28,' v2-calculos'!$D$31:$D$127,0),1)","v":1527.4701805555553}]
[null,null,15,{"$f":"INDEX(' v2-calculos'!$H$31:$H$127,MATCH(C29,' v2-calculos'!$D$31:$D$127,0),1)","v":66566.27},{"$f":"INDEX(' v2-calculos'!$I$31:$I$127,MATCH(C29,' v2-calculos'!$D$31:$D$127,0),1)","v":894.01999999999987},{"$f":"INDEX(' v2-calculos'!$J$31:$J$127,MATCH(C29,' v2-calculos'!$D$31:$D$127,0),1)","v":548.58000000000004},{"$f":"INDEX(' v2-calculos'!$K$31:$K$127,MATCH(C29,' v2-calculos'!$D$31:$D$127,0),1)","v":9.2701805555555552},{"$f":"INDEX(' v2-calculos'!$N$31:$N$127,MATCH(C29,' v2-calculos'!$D$31:$D$127,0),1)","v":5},{"$f":"INDEX(' v2-calculos'!$O$31:$O$127,MATCH(C29,' v2-calculos'!$D$31:$D$127,0),1)","v":70.599999999999994},{"$f":"INDEX(' v2-calculos'!$P$31:$P$127,MATCH(C29,' v2-calculos'!$D$31:$D$127,0),1)","v":1527.4701805555553}]
[null,null,16,{"$f":"INDEX(' v2-calculos'!$H$31:$H$127,MATCH(C30,' v2-calculos'!$D$31:$D$127,0),1)","v":65672.25},{"$f":"INDEX(' v2-calculos'!$I$31:$I$127,MATCH(C30,' v2-calculos'!$D$31:$D$127,0),1)","v":918.92},{"$f":"INDEX(' v2-calculos'!$J$31:$J$127,MATCH(C30,' v2-calculos'!$D$31:$D$127,0),1)","v":523.67999999999995},{"$f":"INDEX(' v2-calculos'!$K$31:$K$127,MATCH(C30,' v2-calculos'!$D$31:$D$127,0),1)","v":9.2701805555555552},{"$f":"INDEX(' v2-calculos'!$N$31:$N$127,MATCH(C30,' v2-calculos'!$D$31:$D$127,0),1)","v":5},{"$f":"INDEX(' v2-calculos'!$O$31:$O$127,MATCH(C30,' v2-calculos'!$D$31:$D$127,0),1)","v":70.599999999999994},{"$f":"INDEX(' v2-calculos'!$P$31:$P$127,MATCH(C30,' v2-calculos'!$D$31:$D$127,0),1)","v":1527.4701805555553}]
{"$rows_left_out":56}