{"text_format":"1","workbook":"xlsx","n_sheets":4,"sheets":["Simulador","Calculos","Hoja1","Hoja1 (2)"],"not_rendered":{"charts":0,"images":2,"macros":1,"external_links":0,"defined_names":0,"comments":1,"pivot_tables":0},"unopened":[],"bounds":{"document_bytes":16777216,"sheet_cells":100000,"rows_first":2000,"rows_last":500,"rows_between":2000,"halvings":0,"cell_chars":16384,"cell_head_chars":4096},"cells_cut":0,"cells_raw":0,"read":"whole","date_system":"1900"}

{"sheet":"Simulador","index":0,"n_rows":1000,"n_cols":26,"rows_kept":1000,"cut":false,"hidden":true,"merged":[[1,2,1,21]]}
[]
[null,null,"SIMULADOR DE CUOTAS - CRÉDITO PLD"]
[]
[]
[null,null,"Importe Solicitado",null,null,null,null,{"$f":"+Hoja1!C8","v":4000},null,null,null,null,null,"Fecha Desembolso",null,null,null,null,{"$f":"+Hoja1!C9","v":"2021-11-25"}]
[null,null,"Saldo de Capital",null,null,null,null,{"$f":"H5","v":4000},null,null,null,null,null,"Fecha Final de Gracia",null,null,null,null,{"$f":"DATE(YEAR(S5+H14),MONTH(S5 + H14),DAY(S5 +H14))","v":"2022-02-23"}]
[null,null,"Saldo de Interes",null,null,null,null,0,null,null,null,null,null,"Fecha de la 1° cuota",null,null,null,null,{"$f":"DATE(YEAR(EDATE(S6,1)),MONTH(EDATE(S6,1)),DAY(EDATE(S6,1)))","v":"2022-03-23"}]
[null,null,"Tasa Anual (TEA)",null,null,null,null,{"$f":"+Hoja1!C11","v":50},null,null,null,null,null,"Fecha final de vencimiento",null,null,null,null,{"$f":"DATE(YEAR(EDATE(S6,H13)),MONTH(EDATE(S6,H13)),DAY(EDATE(S6,H13)))","v":"2026-02-23"}]
[null,null,"Tasa de Seguro de Desgravámen",null,null,null,null,{"$f":"+'Hoja1 (2)'!H13","v":1.8E-3},null,null,null,null,null,"Base",null,null,null,null,360]
[null,null,"Gastos Administrativos",null,null,null,null,0,null,null,null,null,null,"Frecuencia pago en días",null,null,null,null,30]
[null,null,"Comision Envio Informacion",null,null,null,null,0,null,null,null,null,null,"Tasa Equivalente",null,null,null,null,{"$f":"ROUND((((H8/100+1)^(1/(S9/S10))-1)*S9/S10)*100,6)","v":41.2393},"tea conv. A tem luego nominal anual"]
[null,null,null,null,null,null,null,null,null,null,null,null,null,"Días entre cuotas",null,null,null,null,{"$f":"(S8-S6)/H13","v":30.4375},"dias promedio entre cuotas"]
[null,null,"Plazo y  Nro. Cuotas",null,null,null,null,{"$f":"+Hoja1!C10","v":48},{"$f":"IF(H16+ H17>0,VLOOKUP(H13,#REF!,2,FALSE),H13)","v":48},null,null,null,null,"Factor Aplicado",null,null,null,null,{"$f":"($S$11/100)/($S$9/$S$12)","v":3.4867255381944448E-2},"tem convertida de manera nominal a los dias entre cuotas"]
[null,null,"Días de Gracia",null,null,null,null,{"$f":"+Hoja1!C12","v":90},null,null,null,null,null,"Factor Aplicado para la cuota",null,null,null,null,{"$f":"1/((1-((1+$S$13)^(-1*$H$13)))/$S$13)","v":4.3205533783797725E-2},"Factor de cuota (ok)"]
[null,null,"(+/- 30 días antes de la fecha 1° cuota)",null,null,null,null,null,null,null,null,null,null,"Interes de Gracia ",null,null,null,null,{"$f":"IF(H14>0,ROUND(H6*(((1+H8/100)^(ABS(H14)/S9))-1),4),ROUND(H6*(((1+H8/100)^(ABS(H14)/S9))-1),4) * -1)","v":426.72770000000003},"Ok"]
[null,null,"Mes de No Pago 1",null,null,null,null,0,null,null,null,null,null,"Saldo Interes +/- Interes Gracia",null,null,null,null,{"$f":"IF(H7 + S15>0,H7+ S15,0)","v":426.72770000000003}]
[null,null,"Mes de No Pago 2",null,null,null,null,0]
[null,null,"Mes Cuota Doble 1",null,null,null,null,{"$f":"+IF(Hoja1!C14=\"No\",0,IF(Hoja1!C14=\"Julio\",7,12))","v":0}]
[null,null,"Mes Cuota Doble 2",null,null,null," ",{"$f":"+IF(Hoja1!C15=\"No\",0,IF(Hoja1!C15=\"Julio\",7,12))","v":0}]
[]
{"$rows_left_out":981}
{"sheet":"Calculos","index":1,"n_rows":386,"n_cols":7,"rows_kept":386,"cut":false,"hidden":true,"merged":[[0,0,0,6]]}
["Factores utilizados en Meses de No Pago para cálculo del valor cuota"]
[]
["N° de Cuota","Equivalente","Fecha","Mes","Marca Cuota No Pago","Factor (10)","Acumulado"]
[1,{"$f":"IF(E4<>\"C\",IF(ISERROR(1+B3)=TRUE,1,1+B3),IF(ISNUMBER(B3),B3,1))","v":1},{"$f":"+Simulador!S7","v":"2022-03-23"},{"$f":"MONTH(C4)","v":3},{"$f":"IF(ISERROR(MATCH(D4,Simulador!$H$16:$H$17,0))=FALSE,\"C\",IF(ISERROR(MATCH(D4,Simulador!$H$18:$H$19,0))=FALSE,\"D\",\"\"))","v":""},{"$f":"IF(E4=\"C\",0,IF(E4 =\"D\",ROUND(1/((1+Simulador!$S$13)^A4),9) * 2,ROUND(1/((1+Simulador!$S$13)^A4),9)))","v":0.96630750899999995},{"$f":"ROUND(F4,9)","v":0.96630750899999995}]
[{"$f":"A4+1","v":2},{"$f":"IF(E5<>\"C\",IF(ISERROR(1+B4)=TRUE,1,1+B4),IF(ISNUMBER(B4),B4,1))","v":2},{"$f":"DATE(YEAR(C4) + 1/12,MONTH(C4)+1,DAY(C4))","v":"2022-04-23"},4,{"$f":"IF(ISERROR(MATCH(D5,Simulador!$H$16:$H$17,0))=FALSE,\"C\",IF(ISERROR(MATCH(D5,Simulador!$H$18:$H$19,0))=FALSE,\"D\",\"\"))","v":""},{"$f":"IF(E5=\"C\",0,IF(E5 =\"D\",ROUND(1/((1+Simulador!$S$13)^A5),9) * 2,ROUND(1/((1+Simulador!$S$13)^A5),9)))","v":0.933750203},{"$f":"G4+ROUND(F5,9)","v":1.900057712}]
[3,3,"2022-05-23",5,{"$f":"IF(ISERROR(MATCH(D6,Simulador!$H$16:$H$17,0))=FALSE,\"C\",IF(ISERROR(MATCH(D6,Simulador!$H$18:$H$19,0))=FALSE,\"D\",\"\"))","v":""},{"$f":"IF(E6=\"C\",0,IF(E6 =\"D\",ROUND(1/((1+Simulador!$S$13)^A6),9) * 2,ROUND(1/((1+Simulador!$S$13)^A6),9)))","v":0.90228983299999999},{"$f":"G5+ROUND(F6,9)","v":2.8023475449999999}]
[4,4,"2022-06-23",6,{"$f":"IF(ISERROR(MATCH(D7,Simulador!$H$16:$H$17,0))=FALSE,\"C\",IF(ISERROR(MATCH(D7,Simulador!$H$18:$H$19,0))=FALSE,\"D\",\"\"))","v":""},{"$f":"IF(E7=\"C\",0,IF(E7 =\"D\",ROUND(1/((1+Simulador!$S$13)^A7),9) * 2,ROUND(1/((1+Simulador!$S$13)^A7),9)))","v":0.87188944099999999},3.6742369859999999]
[5,5,"2022-07-23",7,{"$f":"IF(ISERROR(MATCH(D8,Simulador!$H$16:$H$17,0))=FALSE,\"C\",IF(ISERROR(MATCH(D8,Simulador!$H$18:$H$19,0))=FALSE,\"D\",\"\"))","v":""},{"$f":"IF(E8=\"C\",0,IF(E8 =\"D\",ROUND(1/((1+Simulador!$S$13)^A8),9) * 2,ROUND(1/((1+Simulador!$S$13)^A8),9)))","v":0.84251331399999996},4.5167503]
[6,6,"2022-08-23",8,{"$f":"IF(ISERROR(MATCH(D9,Simulador!$H$16:$H$17,0))=FALSE,\"C\",IF(ISERROR(MATCH(D9,Simulador!$H$18:$H$19,0))=FALSE,\"D\",\"\"))","v":""},{"$f":"IF(E9=\"C\",0,IF(E9 =\"D\",ROUND(1/((1+Simulador!$S$13)^A9),9) * 2,ROUND(1/((1+Simulador!$S$13)^A9),9)))","v":0.81412694200000002},5.3308772419999997]
[7,7,"2022-09-23",9,{"$f":"IF(ISERROR(MATCH(D10,Simulador!$H$16:$H$17,0))=FALSE,\"C\",IF(ISERROR(MATCH(D10,Simulador!$H$18:$H$19,0))=FALSE,\"D\",\"\"))","v":""},{"$f":"IF(E10=\"C\",0,IF(E10 =\"D\",ROUND(1/((1+Simulador!$S$13)^A10),9) * 2,ROUND(1/((1+Simulador!$S$13)^A10),9)))","v":0.78669697699999996},6.1175742189999998]
[8,8,"2022-10-23",10,{"$f":"IF(ISERROR(MATCH(D11,Simulador!$H$16:$H$17,0))=FALSE,\"C\",IF(ISERROR(MATCH(D11,Simulador!$H$18:$H$19,0))=FALSE,\"D\",\"\"))","v":""},{"$f":"IF(E11=\"C\",0,IF(E11 =\"D\",ROUND(1/((1+Simulador!$S$13)^A11),9) * 2,ROUND(1/((1+Simulador!$S$13)^A11),9)))","v":0.76019119700000004},6.8777654159999999]
[9,9,"2022-11-23",11,{"$f":"IF(ISERROR(MATCH(D12,Simulador!$H$16:$H$17,0))=FALSE,\"C\",IF(ISERROR(MATCH(D12,Simulador!$H$18:$H$19,0))=FALSE,\"D\",\"\"))","v":""},{"$f":"IF(E12=\"C\",0,IF(E12 =\"D\",ROUND(1/((1+Simulador!$S$13)^A12),9) * 2,ROUND(1/((1+Simulador!$S$13)^A12),9)))","v":0.73457846199999999},7.6123438779999999]
[10,10,"2022-12-23",12,{"$f":"IF(ISERROR(MATCH(D13,Simulador!$H$16:$H$17,0))=FALSE,\"C\",IF(ISERROR(MATCH(D13,Simulador!$H$18:$H$19,0))=FALSE,\"D\",\"\"))","v":""},{"$f":"IF(E13=\"C\",0,IF(E13 =\"D\",ROUND(1/((1+Simulador!$S$13)^A13),9) * 2,ROUND(1/((1+Simulador!$S$13)^A13),9)))","v":0.70982868399999999},8.3221725620000004]
[11,11,"2023-01-23",1,{"$f":"IF(ISERROR(MATCH(D14,Simulador!$H$16:$H$17,0))=FALSE,\"C\",IF(ISERROR(MATCH(D14,Simulador!$H$18:$H$19,0))=FALSE,\"D\",\"\"))","v":""},{"$f":"IF(E14=\"C\",0,IF(E14 =\"D\",ROUND(1/((1+Simulador!$S$13)^A14),9) * 2,ROUND(1/((1+Simulador!$S$13)^A14),9)))","v":0.685912788},9.00808535]
[12,12,"2023-02-23",2,{"$f":"IF(ISERROR(MATCH(D15,Simulador!$H$16:$H$17,0))=FALSE,\"C\",IF(ISERROR(MATCH(D15,Simulador!$H$18:$H$19,0))=FALSE,\"D\",\"\"))","v":""},{"$f":"IF(E15=\"C\",0,IF(E15 =\"D\",ROUND(1/((1+Simulador!$S$13)^A15),9) * 2,ROUND(1/((1+Simulador!$S$13)^A15),9)))","v":0.66280267699999995},9.6708880270000002]
[13,13,"2023-03-23",3,{"$f":"IF(ISERROR(MATCH(D16,Simulador!$H$16:$H$17,0))=FALSE,\"C\",IF(ISERROR(MATCH(D16,Simulador!$H$18:$H$19,0))=FALSE,\"D\",\"\"))","v":""},{"$f":"IF(E16=\"C\",0,IF(E16 =\"D\",ROUND(1/((1+Simulador!$S$13)^A16),9) * 2,ROUND(1/((1+Simulador!$S$13)^A16),9)))","v":0.64047120400000002},10.311359231000001]
[14,14,"2023-04-23",4,{"$f":"IF(ISERROR(MATCH(D17,Simulador!$H$16:$H$17,0))=FALSE,\"C\",IF(ISERROR(MATCH(D17,Simulador!$H$18:$H$19,0))=FALSE,\"D\",\"\"))","v":""},{"$f":"IF(E17=\"C\",0,IF(E17 =\"D\",ROUND(1/((1+Simulador!$S$13)^A17),9) * 2,ROUND(1/((1+Simulador!$S$13)^A17),9)))","v":0.61889213399999998},10.930251365]
[15,15,"2023-05-23",5,{"$f":"IF(ISERROR(MATCH(D18,Simulador!$H$16:$H$17,0))=FALSE,\"C\",IF(ISERROR(MATCH(D18,Simulador!$H$18:$H$19,0))=FALSE,\"D\",\"\"))","v":""},{"$f":"IF(E18=\"C\",0,IF(E18 =\"D\",ROUND(1/((1+Simulador!$S$13)^A18),9) * 2,ROUND(1/((1+Simulador!$S$13)^A18),9)))","v":0.59804011700000004},11.528291482]
[16,16,"2023-06-23",6,{"$f":"IF(ISERROR(MATCH(D19,Simulador!$H$16:$H$17,0))=FALSE,\"C\",IF(ISERROR(MATCH(D19,Simulador!$H$18:$H$19,0))=FALSE,\"D\",\"\"))","v":""},{"$f":"IF(E19=\"C\",0,IF(E19 =\"D\",ROUND(1/((1+Simulador!$S$13)^A19),9) * 2,ROUND(1/((1+Simulador!$S$13)^A19),9)))","v":0.577890656},12.106182137999999]
[17,17,"2023-07-23",7,{"$f":"IF(ISERROR(MATCH(D20,Simulador!$H$16:$H$17,0))=FALSE,\"C\",IF(ISERROR(MATCH(D20,Simulador!$H$18:$H$19,0))=FALSE,\"D\",\"\"))","v":""},{"$f":"IF(E20=\"C\",0,IF(E20 =\"D\",ROUND(1/((1+Simulador!$S$13)^A20),9) * 2,ROUND(1/((1+Simulador!$S$13)^A20),9)))","v":0.55842007999999999},12.664602217999999]
{"$rows_left_out":367}
{"sheet":"Hoja1","index":2,"n_rows":19,"n_cols":13,"rows_kept":19,"cut":false,"hidden":false,"merged":[[15,0,15,1],[16,0,16,1],[2,2,3,3],[18,0,18,3]]}
[]
[]
[null,null,"SIMULADOR PRÉSTAMO PERSONAL\nSIN GARANTÍA",null,null,null,"Soles"]
[null,null,null,null,null,null,"Dólares"]
[]
[null,null,null,null,null,null,"No"]
[null,"Moneda","Soles",null,null,null,"Julio"]
[null,"Monto del Préstamo",4000,null,null,null,"Diciembre"]
[null,"Fecha de Desembolso","2021-11-25",null,null,null,null,null,null,null,null,null,0]
[null,"Plazo",48,null,null,null,"Banco",null,null,null,null,null,30]
[null,"TEA",50,null,null,null,"Endoso",null,null,null,null,null,60]
[null,"Días de Gracia",90,null,null,null,null,null,null,null,null,null,90]
[null,"Seguro Desgravamen","Banco"]
[null,"Cuota Doble 1","No"]
[null,"Cuota Doble 2","No"]
[]
[]
[]
["•  \tLa cotización obtenida no representa la aprobación del crédito, la cual está sujeta a la evaluación crediticia que debe realizar el Banco.\n•  \tEste simulador es referencial en base a la información ingresada.\n•  \tEsta simulación no incluye ITF (Impuesto a las Transacciones Financieras). Consulte el tarifario del producto antes de realizar la simulación.\n•  \tEl seguro de desgravamen se calcula sobre el monto principal del crédito. El costo del seguro es el cobrado por la aseguradora, de acuerdo con las condiciones establecidas por esta.\n•  \tEl cliente puede optar por contratar el/los seguros(s) incluido(s) en la simulación directamente o a través de un corredor de seguros, en tanto posea(n) las mismas condiciones que el/los comercializado(s) por el Banco y cubra(n) al 100% el importe de capital adeudado.\n•  \tEn el caso de incumplimiento en los pagos, se aplicará la tasa de interés moratorio anual establecido. Mayor información visite \"Tasas y Tarifas\" y/o \"Formulas y Ejemplos\", publicados en nuestra web\n•  \tEn caso el cliente decida endosar el seguro de desgravamen, se precisa que la póliza endosada deberá ser presentada mediante una solicitud que cumpla con los requisitos y procedimientos establecidos por el Banco, a través de la página web u otro canal que éste ponga a disposición del cliente y el Banco responderá a dicha solicitud dentro del plazo de 20 días calendario posteriores a la presentación de dicha solicitud\n•\t  Esta información se proporciona de acuerdo con el Reglamento de Gestión de Conducta de Mercado del Sistema Financiero."]

{"sheet":"Hoja1 (2)","index":3,"n_rows":93,"n_cols":9,"rows_kept":93,"cut":false,"hidden":false,"merged":[[13,1,13,2],[13,5,13,6],[4,1,4,7],[5,1,5,7],[8,1,8,2],[9,1,9,2],[10,1,10,2],[11,1,11,2],[12,1,12,2],[8,5,8,6],[9,5,9,6],[10,5,10,6],[11,5,11,6],[12,5,12,6]]}
[]
[]
[]
[]
[null,"(SIMULACIÓN)"]
[null,"CRONOGRAMA DE PAGOS"]
[]
[]
[null,"Moneda                                                  :",null,{"$f":"+Hoja1!C7","v":"Soles"},null,"Monto del Préstamo                                                    :",null,{"$f":"+Hoja1!C8","v":4000}]
[null,"Producto                                                :",null,"Préstamo Personal Sin Garantía",null,"Tasa Efectiva Anual                                                      :",null,{"$f":"+Hoja1!C11&\"%\"","v":"50%"}]
[null,"Fecha de desembolso                          :",null,{"$f":"+Hoja1!C9","v":"2021-11-25"},null,"Plazo (en meses)                                                          :",null,{"$f":"+Hoja1!C10","v":48}]
[null,"Mes de Cuota Doble 1                          :",null,{"$f":"+Hoja1!C14","v":"No"},null,"Tasa de Costo Efectiva Anual                                     :",null,{"$f":"+((1+I12)^12)-1","v":0.54631786466514898},{"$f":"+RATE(H11,H18,-H9-I13)","v":3.6990786523445812E-2}]
[null,"Mes de Cuota Doble 2                          :",null,{"$f":"+Hoja1!C15","v":"No"},null,"Tasa Seguro de Desgravamen Mensual                   :",null,{"$f":"+IF(Hoja1!C13=\"Endoso\",0,0.18%)","v":1.8E-3},{"$f":"+Simulador!S16","v":426.72770000000003}]
[null,"Periodo de gracia                                 :",null,{"$f":"+Hoja1!C12&\" \"& \"días\"","v":"90 días"}]
[]
[]
[null,"N°","Fecha Vencimiento","Capital","Interes","Interes de Gracia","Seguro Desgravamen","Total Cuota"]
[null,1,{"$f":"IFERROR(+IF(B18>0,VLOOKUP(B18,Simulador!$A$32:$T$550,3,0),\" \"),\" \")","v":"2022-03-23"},{"$f":"IFERROR(+IF(B18>0,VLOOKUP(B18,Simulador!$A$32:$T$550,13,0),\" \"),\" \")","v":23.069999999999986},{"$f":"IFERROR(+IF(B18>0,VLOOKUP(B18,Simulador!$A$32:$T$550,14,0),\" \"),\" \")","v":128.15},{"$f":"IFERROR(+IF(B18>0,VLOOKUP(B18,Simulador!$A$32:$T$550,15,0),\" \"),\" \")","v":18.440000000000001},{"$f":"IFERROR(+IF(B18>0,VLOOKUP(B18,Simulador!$A$32:$T$550,19,0),\" \"),\" \")","v":28.8},{"$f":"IFERROR(+IF(B18>0,VLOOKUP(B18,Simulador!$A$32:$T$550,20,0),\" \"),\" \")","v":198.46}]
[null,{"$f":"IF(B18=0,\" \",IF(B18>=$H$11,\"\",B18+1))","v":2},{"$f":"IF($H$11=0,\" \",IF(B18=$H$11,\"TOTALES\",+IF(B19>0,VLOOKUP(B19,Simulador!$A$32:$T$550,3,0),\" \")))","v":"2022-04-23"},{"$f":"IF($H$11=0,\" \",IF(B18=$H$11,Simulador!$M$30,+IF(B19>0,VLOOKUP(B19,Simulador!$A$32:$T$550,13,0),\" \")))","v":31.509999999999991},{"$f":"IF($H$11=0,\" \",IF(B18=$H$11,Simulador!$N$30,+IF(B19>0,VLOOKUP(B19,Simulador!$A$32:$T$550,14,0),\" \")))","v":141.31},{"$f":"IF($H$11=0,\" \",IF(B18=$H$11,Simulador!$O$30,+IF(B19>0,VLOOKUP(B19,Simulador!$A$32:$T$550,15,0),\" \")))","v":18.440000000000001},{"$f":"IF($H$11=0,\" \",IF(B18=$H$11,Simulador!$S$30,+IF(B19>0,VLOOKUP(B19,Simulador!$A$32:$T$550,19,0),\" \")))","v":7.2},{"$f":"IF($H$11=0,\" \",IF(B18=$H$11,Simulador!$T$30,+IF(B19>0,VLOOKUP(B19,Simulador!$A$32:$T$550,20,0),\" \")))","v":198.45999999999998}]
[null,{"$f":"IF(B19=0,\" \",IF(B19>=$H$11,\"\",B19+1))","v":3},{"$f":"IF($H$11=0,\" \",IF(B19=$H$11,\"TOTALES\",+IF(B20>0,VLOOKUP(B20,Simulador!$A$32:$T$550,3,0),\" \")))","v":"2022-05-23"},{"$f":"IF($H$11=0,\" \",IF(B19=$H$11,Simulador!$M$30,+IF(B20>0,VLOOKUP(B20,Simulador!$A$32:$T$550,13,0),\" \")))","v":37.22999999999999},{"$f":"IF($H$11=0,\" \",IF(B19=$H$11,Simulador!$N$30,+IF(B20>0,VLOOKUP(B20,Simulador!$A$32:$T$550,14,0),\" \")))","v":135.59},{"$f":"IF($H$11=0,\" \",IF(B19=$H$11,Simulador!$O$30,+IF(B20>0,VLOOKUP(B20,Simulador!$A$32:$T$550,15,0),\" \")))","v":18.440000000000001},{"$f":"IF($H$11=0,\" \",IF(B19=$H$11,Simulador!$S$30,+IF(B20>0,VLOOKUP(B20,Simulador!$A$32:$T$550,19,0),\" \")))","v":7.2},{"$f":"IF($H$11=0,\" \",IF(B19=$H$11,Simulador!$T$30,+IF(B20>0,VLOOKUP(B20,Simulador!$A$32:$T$550,20,0),\" \")))","v":198.45999999999998}]
{"$rows_left_out":73}