{"text_format":"1","workbook":"xlsx","n_sheets":5,"sheets":["Calculos","Simulador_Cliente","Cronograma_Referencial","Simulador_v2","Cronograma_Referencial (2)"],"not_rendered":{"charts":0,"images":2,"macros":1,"external_links":1,"defined_names":0,"comments":1,"pivot_tables":0},"unopened":[],"bounds":{"document_bytes":16777216,"sheet_cells":100000,"rows_first":2000,"rows_last":500,"rows_between":2000,"halvings":0,"cell_chars":16384,"cell_head_chars":4096},"cells_cut":0,"cells_raw":0,"read":"whole","date_system":"1900"}

{"sheet":"Calculos","index":0,"n_rows":386,"n_cols":7,"rows_kept":386,"cut":false,"hidden":true,"merged":[[0,0,0,6]]}
["Factores utilizados en Meses de No Pago para cálculo del valor cuota"]
[]
["N° de Cuota","Equivalente","Fecha","Mes","Marca Cuota No Pago","Factor (10)","Acumulado"]
[1,{"$f":"IF(E4<>\"C\",IF(ISERROR(1+B3)=TRUE,1,1+B3),IF(ISNUMBER(B3),B3,1))","v":1},{"$f":"+#REF!","v":{"$error":"#REF!"}},{"$f":"MONTH(C4)","v":{"$error":"#REF!"}},{"$f":"IF(ISERROR(MATCH(D4,#REF!,0))=FALSE,\"C\",IF(ISERROR(MATCH(D4,#REF!,0))=FALSE,\"D\",\"\"))","v":""},{"$f":"IF(E4=\"C\",0,IF(E4 =\"D\",ROUND(1/((1+#REF!)^A4),9) * 2,ROUND(1/((1+#REF!)^A4),9)))","v":{"$error":"#REF!"}},{"$f":"ROUND(F4,9)","v":{"$error":"#REF!"}}]
[{"$f":"A4+1","v":2},{"$f":"IF(E5<>\"C\",IF(ISERROR(1+B4)=TRUE,1,1+B4),IF(ISNUMBER(B4),B4,1))","v":2},{"$f":"DATE(YEAR(C4) + 1/12,MONTH(C4)+1,DAY(C4))","v":{"$error":"#REF!"}},{"$error":"#REF!"},{"$f":"IF(ISERROR(MATCH(D5,#REF!,0))=FALSE,\"C\",IF(ISERROR(MATCH(D5,#REF!,0))=FALSE,\"D\",\"\"))","v":""},{"$f":"IF(E5=\"C\",0,IF(E5 =\"D\",ROUND(1/((1+#REF!)^A5),9) * 2,ROUND(1/((1+#REF!)^A5),9)))","v":{"$error":"#REF!"}},{"$f":"G4+ROUND(F5,9)","v":{"$error":"#REF!"}}]
[3,3,{"$error":"#REF!"},{"$error":"#REF!"},{"$f":"IF(ISERROR(MATCH(D6,#REF!,0))=FALSE,\"C\",IF(ISERROR(MATCH(D6,#REF!,0))=FALSE,\"D\",\"\"))","v":""},{"$f":"IF(E6=\"C\",0,IF(E6 =\"D\",ROUND(1/((1+#REF!)^A6),9) * 2,ROUND(1/((1+#REF!)^A6),9)))","v":{"$error":"#REF!"}},{"$f":"G5+ROUND(F6,9)","v":{"$error":"#REF!"}}]
[4,4,{"$error":"#REF!"},{"$error":"#REF!"},{"$f":"IF(ISERROR(MATCH(D7,#REF!,0))=FALSE,\"C\",IF(ISERROR(MATCH(D7,#REF!,0))=FALSE,\"D\",\"\"))","v":""},{"$f":"IF(E7=\"C\",0,IF(E7 =\"D\",ROUND(1/((1+#REF!)^A7),9) * 2,ROUND(1/((1+#REF!)^A7),9)))","v":{"$error":"#REF!"}},{"$error":"#REF!"}]
[5,5,{"$error":"#REF!"},{"$error":"#REF!"},{"$f":"IF(ISERROR(MATCH(D8,#REF!,0))=FALSE,\"C\",IF(ISERROR(MATCH(D8,#REF!,0))=FALSE,\"D\",\"\"))","v":""},{"$f":"IF(E8=\"C\",0,IF(E8 =\"D\",ROUND(1/((1+#REF!)^A8),9) * 2,ROUND(1/((1+#REF!)^A8),9)))","v":{"$error":"#REF!"}},{"$error":"#REF!"}]
[6,6,{"$error":"#REF!"},{"$error":"#REF!"},{"$f":"IF(ISERROR(MATCH(D9,#REF!,0))=FALSE,\"C\",IF(ISERROR(MATCH(D9,#REF!,0))=FALSE,\"D\",\"\"))","v":""},{"$f":"IF(E9=\"C\",0,IF(E9 =\"D\",ROUND(1/((1+#REF!)^A9),9) * 2,ROUND(1/((1+#REF!)^A9),9)))","v":{"$error":"#REF!"}},{"$error":"#REF!"}]
[7,7,{"$error":"#REF!"},{"$error":"#REF!"},{"$f":"IF(ISERROR(MATCH(D10,#REF!,0))=FALSE,\"C\",IF(ISERROR(MATCH(D10,#REF!,0))=FALSE,\"D\",\"\"))","v":""},{"$f":"IF(E10=\"C\",0,IF(E10 =\"D\",ROUND(1/((1+#REF!)^A10),9) * 2,ROUND(1/((1+#REF!)^A10),9)))","v":{"$error":"#REF!"}},{"$error":"#REF!"}]
[8,8,{"$error":"#REF!"},{"$error":"#REF!"},{"$f":"IF(ISERROR(MATCH(D11,#REF!,0))=FALSE,\"C\",IF(ISERROR(MATCH(D11,#REF!,0))=FALSE,\"D\",\"\"))","v":""},{"$f":"IF(E11=\"C\",0,IF(E11 =\"D\",ROUND(1/((1+#REF!)^A11),9) * 2,ROUND(1/((1+#REF!)^A11),9)))","v":{"$error":"#REF!"}},{"$error":"#REF!"}]
[9,9,{"$error":"#REF!"},{"$error":"#REF!"},{"$f":"IF(ISERROR(MATCH(D12,#REF!,0))=FALSE,\"C\",IF(ISERROR(MATCH(D12,#REF!,0))=FALSE,\"D\",\"\"))","v":""},{"$f":"IF(E12=\"C\",0,IF(E12 =\"D\",ROUND(1/((1+#REF!)^A12),9) * 2,ROUND(1/((1+#REF!)^A12),9)))","v":{"$error":"#REF!"}},{"$error":"#REF!"}]
[10,10,{"$error":"#REF!"},{"$error":"#REF!"},{"$f":"IF(ISERROR(MATCH(D13,#REF!,0))=FALSE,\"C\",IF(ISERROR(MATCH(D13,#REF!,0))=FALSE,\"D\",\"\"))","v":""},{"$f":"IF(E13=\"C\",0,IF(E13 =\"D\",ROUND(1/((1+#REF!)^A13),9) * 2,ROUND(1/((1+#REF!)^A13),9)))","v":{"$error":"#REF!"}},{"$error":"#REF!"}]
[11,11,{"$error":"#REF!"},{"$error":"#REF!"},{"$f":"IF(ISERROR(MATCH(D14,#REF!,0))=FALSE,\"C\",IF(ISERROR(MATCH(D14,#REF!,0))=FALSE,\"D\",\"\"))","v":""},{"$f":"IF(E14=\"C\",0,IF(E14 =\"D\",ROUND(1/((1+#REF!)^A14),9) * 2,ROUND(1/((1+#REF!)^A14),9)))","v":{"$error":"#REF!"}},{"$error":"#REF!"}]
[12,12,{"$error":"#REF!"},{"$error":"#REF!"},{"$f":"IF(ISERROR(MATCH(D15,#REF!,0))=FALSE,\"C\",IF(ISERROR(MATCH(D15,#REF!,0))=FALSE,\"D\",\"\"))","v":""},{"$f":"IF(E15=\"C\",0,IF(E15 =\"D\",ROUND(1/((1+#REF!)^A15),9) * 2,ROUND(1/((1+#REF!)^A15),9)))","v":{"$error":"#REF!"}},{"$error":"#REF!"}]
[13,13,{"$error":"#REF!"},{"$error":"#REF!"},{"$f":"IF(ISERROR(MATCH(D16,#REF!,0))=FALSE,\"C\",IF(ISERROR(MATCH(D16,#REF!,0))=FALSE,\"D\",\"\"))","v":""},{"$f":"IF(E16=\"C\",0,IF(E16 =\"D\",ROUND(1/((1+#REF!)^A16),9) * 2,ROUND(1/((1+#REF!)^A16),9)))","v":{"$error":"#REF!"}},{"$error":"#REF!"}]
[14,14,{"$error":"#REF!"},{"$error":"#REF!"},{"$f":"IF(ISERROR(MATCH(D17,#REF!,0))=FALSE,\"C\",IF(ISERROR(MATCH(D17,#REF!,0))=FALSE,\"D\",\"\"))","v":""},{"$f":"IF(E17=\"C\",0,IF(E17 =\"D\",ROUND(1/((1+#REF!)^A17),9) * 2,ROUND(1/((1+#REF!)^A17),9)))","v":{"$error":"#REF!"}},{"$error":"#REF!"}]
[15,15,{"$error":"#REF!"},{"$error":"#REF!"},{"$f":"IF(ISERROR(MATCH(D18,#REF!,0))=FALSE,\"C\",IF(ISERROR(MATCH(D18,#REF!,0))=FALSE,\"D\",\"\"))","v":""},{"$f":"IF(E18=\"C\",0,IF(E18 =\"D\",ROUND(1/((1+#REF!)^A18),9) * 2,ROUND(1/((1+#REF!)^A18),9)))","v":{"$error":"#REF!"}},{"$error":"#REF!"}]
[16,16,{"$error":"#REF!"},{"$error":"#REF!"},{"$f":"IF(ISERROR(MATCH(D19,#REF!,0))=FALSE,\"C\",IF(ISERROR(MATCH(D19,#REF!,0))=FALSE,\"D\",\"\"))","v":""},{"$f":"IF(E19=\"C\",0,IF(E19 =\"D\",ROUND(1/((1+#REF!)^A19),9) * 2,ROUND(1/((1+#REF!)^A19),9)))","v":{"$error":"#REF!"}},{"$error":"#REF!"}]
[17,17,{"$error":"#REF!"},{"$error":"#REF!"},{"$f":"IF(ISERROR(MATCH(D20,#REF!,0))=FALSE,\"C\",IF(ISERROR(MATCH(D20,#REF!,0))=FALSE,\"D\",\"\"))","v":""},{"$f":"IF(E20=\"C\",0,IF(E20 =\"D\",ROUND(1/((1+#REF!)^A20),9) * 2,ROUND(1/((1+#REF!)^A20),9)))","v":{"$error":"#REF!"}},{"$error":"#REF!"}]
{"$rows_left_out":367}
{"sheet":"Simulador_Cliente","index":1,"n_rows":21,"n_cols":38,"rows_kept":21,"cut":false,"hidden":false,"merged":[[2,2,3,4],[18,0,18,1]]}
[]
[]
[null,null,"SIMULADOR PRÉSTAMO \nBANCA EMPRENDEDORA PYME",null,null,null,null,null,null,null,null,null,null,"Soles"]
[null,null,null,null,null,null,null,null,null,null,null,null,null,"Dólares"]
[]
[null,null,null,null,null,null,null,null,null,null,null,null,null,"No"]
[null,"Moneda","Soles",null,null,null,null,null,null,null,null,null,null,"Julio"]
[null,"Producto","Capital de Trabajo PYME",null,null,null,null,null,null,null,null,null,null,"Diciembre"]
[null,"Monto del Préstamo",1000000]
[null,"Fecha de Desembolso","2022-07-17",null,null,null,null,null,null,null,null,null,null,null,null,null,null,null,null,0]
[null,"Plazo",84,null,null,null,null,null,null,null,null,null,null,"Con Retorno",null,null,null,null,null,30,null,{"$f":"+IF(C14=\"Con Retorno\",\"0.299%\",IF(C14=\"Endosado\",0,\"0.07%\"))","v":"0.299%"},null,null,{"$f":"IF(C8=N20,C11<=18,IF(C8=N17,C11<=24,C11<=36))","v":false},"O(C11=\" \";Y(C11>=1;C11<=60))"]
[null,"TEA",20.100000000000001,null,null,null,null,null,null,null,null,null,null,"Sin Retorno",null,null,null,null,null,60]
[null,"Días de Gracia",35,null,null,null,null,null,null,null,null,null,null,"Endosado",null,null,null,null,null,90]
[null,"Seguro Desgravamen","Con Retorno",null,null,null,null,null,null,null,null,null,null,"Sí",null,null,null,null,null,180]
[null,"Tasa Seguro Desgravamen",{"$f":"+V11","v":"0.299%"},null,null,null,null,null,null,null,null,null,null,"No"]
[null,"Seguro Multiriesgo","Sí"]
[null,"Seguro Todo Riesgo","Sí",null,null,null,null,null,null,null,null,null,null,"Capital de Trabajo PYME",null,null,null,null,null,null,null,null,null,null,null,24,null,null,8.3000000000000007,null,20.100000000000001,null,null,null,null,null,null,{"$f":"OR(C18=\" \",C18>C9)","v":false}]
[null,{"$f":"+IF(C17=\"Sí\",\"Valor del Bien a asegurar\",\"\")","v":"Valor del Bien a asegurar"},602716,null,null,null,null,null,null,null,null,null,null,"Activo Fijo PYME",null,null,null,null,null,null,null,180,null,null,null,84,null,null,7.9,null,19.600000000000001]
[null,null,null,null,null,null,null,null,null,null,null,null,null,"Vivienda"]
[null,null,null,null,null,null,null,null,null,null,null,null,null,"Consumo"]
{"$rows_left_out":2}
{"sheet":"Cronograma_Referencial","index":2,"n_rows":190,"n_cols":10,"rows_kept":190,"cut":false,"hidden":false,"merged":[[13,5,13,6],[12,1,12,2],[12,5,12,6],[4,1,4,9],[5,1,5,9],[8,1,8,2],[9,1,9,2],[10,1,10,2],[8,5,8,6],[9,5,9,6],[11,1,11,2],[10,5,10,6],[11,5,11,6]]}
[]
[]
[]
[]
[null,"(SIMULACIÓN)"]
[null,"CRONOGRAMA DE PAGOS"]
[]
[]
[null,"Moneda                                                  :",null,{"$f":"+Simulador_Cliente!C7","v":"Soles"},null,"Monto del Préstamo                                                  :",null,{"$f":"+Simulador_Cliente!C9","v":1000000}]
[null,"Producto                                                :",null,{"$f":"+Simulador_Cliente!C8","v":"Capital de Trabajo PYME"},null,"Tasa Efectiva Anual                                                  :",null,{"$f":"+Simulador_Cliente!C12&\"%\"","v":"20.1%"}]
[null,"Fecha de desembolso                          :",null,{"$f":"+Simulador_Cliente!C10","v":"2022-07-17"},null,"Tasa de Costo Efectiva Anual                                   :",null,{"$f":"+((1+I11)^12)-1","v":0.24414146303301654},{"$f":"+RATE(D12,J18,-H9-I12)","v":1.8370507985977575E-2}]
[null,"Plazo (en meses)                                                          :",null,{"$f":"+Simulador_Cliente!C11","v":84},null,"Tasa Seguro de Desgravamen Mensual                   :",null,{"$f":"+Simulador_Cliente!C15","v":"0.299%"},{"$f":"+Simulador_v2!Q16","v":17966.175999999999}]
[null,"Periodo de gracia                                 :",null,{"$f":"+Simulador_Cliente!C13&\" \"& \"días\"","v":"35 días"},null,"Tasa Seguro de Seguro Multiriesgo                         :",null,{"$f":"+IF(Simulador_Cliente!C16=\"No\",0,0.07%)","v":7.000000000000001E-4}]
[null,null,null,null,null,"Tasa Seguro Todo Riesgo                                        :",null,{"$f":"+IF(Simulador_Cliente!C17=\"No\",0,0.0292%)","v":2.92E-4}]
[]
[]
[null,"N°","Fecha Vencimiento","Capital","Interes","Interes de Gracia","Seguro Desgravamen","Seguro Multiriesgos","Seguro Todo Riesgo","Total Cuota"]
[null,1,{"$f":"IFERROR(+IF(B18>0,VLOOKUP(B18,Simulador_v2!$A$33:$AJ$273,3,0),\" \"),\" \")","v":"2022-10-22"},{"$f":"IFERROR(+IF(B18>0,VLOOKUP(B18,Simulador_v2!$A$33:$AJ$273,11,0),\" \"),\" \")","v":-92.654999999997273},{"$f":"IFERROR(+IF(B18>0,VLOOKUP(B18,Simulador_v2!$A$33:$AJ$273,12,0),\" \"),\" \")","v":15379.95},{"$f":"IFERROR(+IF(B18>0,VLOOKUP(B18,Simulador_v2!$A$33:$AJ$273,13,0),\" \"),\" \")","v":213.88300000000001},{"$f":"IFERROR(+IF(B18>0,VLOOKUP(B18,Simulador_v2!$A$33:$AJ$273,20,0),\" \"),\" \")","v":6478.33},{"$f":"IFERROR(+IF(B18>0,VLOOKUP(B18,Simulador_v2!$A$33:$AJ$273,26,0),\" \"),\" \")","v":1516.6599999999999},{"$f":"IFERROR(+IF(B18>0,VLOOKUP(B18,Simulador_v2!$A$33:$AJ$273,23,0),\" \"),\" \")","v":378.7},{"$f":"IFERROR(+IF(B18>0,VLOOKUP(B18,Simulador_v2!$A$33:$AJ$273,36,0),\" \"),\" \")","v":23874.868000000006}]
[null,{"$f":"IF(B18=0,\" \",IF(B18>=$D$12,\"\",B18+1))","v":2},{"$f":"IF($D$12=0,\" \",IF(B18=$D$12,\"TOTALES\",+IF(B19>0,VLOOKUP(B19,Simulador_v2!$A$33:$AJ$273,3,0),\" \")))","v":"2022-11-22"},{"$f":"IF($D$12=0,\" \",IF(B18=$D$12,Simulador_v2!$K$32,+IF(B19>0,VLOOKUP(B19,Simulador_v2!$A$33:$AJ$273,11,0),\" \")))","v":3798.1050000000041},{"$f":"IF($D$12=0,\" \",IF(B18=$D$12,Simulador_v2!$L$32,+IF(B19>0,VLOOKUP(B19,Simulador_v2!$A$33:$AJ$273,12,0),\" \")))","v":15898.14},{"$f":"IF($D$12=0,\" \",IF(B18=$D$12,Simulador_v2!$M$32,+IF(B19>0,VLOOKUP(B19,Simulador_v2!$A$33:$AJ$273,13,0),\" \")))","v":213.88300000000001},{"$f":"IF($D$12=0,\" \",IF(B18=$D$12,Simulador_v2!$T$32,+IF(B19>0,VLOOKUP(B19,Simulador_v2!$A$33:$AJ$273,20,0),\" \")))","v":3089.95},{"$f":"IF($D$12=0,\" \",IF(B18=$D$12,Simulador_v2!$Z$32,+IF(B19>0,VLOOKUP(B19,Simulador_v2!$A$33:$AJ$273,26,0),\" \")))","v":700},{"$f":"IF($D$12=0,\" \",IF(B18=$D$12,Simulador_v2!$W$32,+IF(B19>0,VLOOKUP(B19,Simulador_v2!$A$33:$AJ$273,23,0),\" \")))","v":174.79},{"$f":"IF($D$12=0,\" \",IF(B18=$D$12,Simulador_v2!$AJ$32,+IF(B19>0,VLOOKUP(B19,Simulador_v2!$A$33:$AJ$273,36,0),\" \")))","v":23874.868000000006}]
[null,3,{"$f":"IF($D$12=0,\" \",IF(B19=$D$12,\"TOTALES\",+IF(B20>0,VLOOKUP(B20,Simulador_v2!$A$33:$AJ$273,3,0),\" \")))","v":"2022-12-22"},{"$f":"IF($D$12=0,\" \",IF(B19=$D$12,Simulador_v2!$K$32,+IF(B20>0,VLOOKUP(B20,Simulador_v2!$A$33:$AJ$273,11,0),\" \")))","v":4484.3150000000041},{"$f":"IF($D$12=0,\" \",IF(B19=$D$12,Simulador_v2!$L$32,+IF(B20>0,VLOOKUP(B20,Simulador_v2!$A$33:$AJ$273,12,0),\" \")))","v":15322.96},{"$f":"IF($D$12=0,\" \",IF(B19=$D$12,Simulador_v2!$M$32,+IF(B20>0,VLOOKUP(B20,Simulador_v2!$A$33:$AJ$273,13,0),\" \")))","v":213.88300000000001},{"$f":"IF($D$12=0,\" \",IF(B19=$D$12,Simulador_v2!$T$32,+IF(B20>0,VLOOKUP(B20,Simulador_v2!$A$33:$AJ$273,20,0),\" \")))","v":2978.92},{"$f":"IF($D$12=0,\" \",IF(B19=$D$12,Simulador_v2!$Z$32,+IF(B20>0,VLOOKUP(B20,Simulador_v2!$A$33:$AJ$273,26,0),\" \")))","v":700},{"$f":"IF($D$12=0,\" \",IF(B19=$D$12,Simulador_v2!$W$32,+IF(B20>0,VLOOKUP(B20,Simulador_v2!$A$33:$AJ$273,23,0),\" \")))","v":174.79},{"$f":"IF($D$12=0,\" \",IF(B19=$D$12,Simulador_v2!$AJ$32,+IF(B20>0,VLOOKUP(B20,Simulador_v2!$A$33:$AJ$273,36,0),\" \")))","v":23874.868000000002}]
{"$rows_left_out":171}
{"sheet":"Simulador_v2","index":3,"n_rows":275,"n_cols":50,"rows_kept":275,"cut":false,"hidden":false,"merged":[[29,17,29,18],[32,40,32,41]]}
[]
[null,null,"SIMULADOR DE CUOTAS - CRÉDITO HIPOTECARIO",null,null,null,null,null,null,null,null,null,null,null,null,null,null,null,null,null,null,null,null,null,null,null,null,{"$f":"NOW()","v":"2022-11-09T16:37:11.010"}]
[]
[]
[null,null,"Importe Solicitado",null,null,null,null,{"$f":"+Simulador_Cliente!C9","v":1000000},null,null,null,"Fecha Desembolso",null,null,null,null,"2022-08-18"]
[null,null,"Saldo de Capital",null,null,null,null,{"$f":"H5","v":1000000},null,null,null,"Fecha Final de Gracia",null,null,null,null,{"$f":"+DATE(YEAR(Q5+H16),MONTH(Q5+H16),DAY(Q5+H16))","v":"2022-09-22"}]
[null,null,"Saldo de Interes",null,null,null,null,0,null,null,null,"Fecha de la 1° cuota",null,null,null,null,{"$f":"DATE(YEAR(EDATE(Q6,1)),MONTH(EDATE(Q6,1)),DAY(EDATE(Q6,1)))","v":"2022-10-22"}]
[null,null,"Tasa Anual (TEA)",null,null,null,null,{"$f":"+Simulador_Cliente!C12","v":20.100000000000001},null,null,null,"Fecha final de vencimiento",null,null,null,null,{"$f":"IF(OR($H$17>0,$H$18>0),VLOOKUP($H$15,$A$33:$C$272,3,0),DATE(YEAR(EDATE(Q6,H15)),MONTH(EDATE(Q6,H15)),DAY(EDATE(Q6,H15))))","v":"2029-09-22"}]
[null,null,"Tasa de Seguro de Desgravamen",null,null,null,null,{"$f":"+Simulador_Cliente!C15","v":"0.299%"},null,null,null,"Base",null,null,null,null,360]
[null,null,"Tasa Anual (TEA) - Ajustada",null,null,null,null,{"$f":"+H8","v":20.100000000000001},null,null,null,"Frecuencia pago en días",null,null,null,null,30]
[null,null,"Comision por Env. Inf",null,null,null,null,0,null,null,null,"Tasa Equivalente - Ajustada",null,null,null,null,{"$f":"ROUND((((H10/100+1)^(1/(Q9/Q10))-1)*Q9/Q10)*100,6)","v":18.455940999999999},"tea conv. A tem luego nominal anual"]
[null,null,"Seguro Multiriesgo","SI / NO",null,null,null,6.9999999999999999E-4,{"$f":"+Simulador_Cliente!$C$16","v":"Sí"},null,null,"Días entre cuotas",null,null,null,null,{"$f":"(Q8-Q6)/H15","v":30.44047619047619},"dias promedio entre cuotas"]
[null,null,"Valor Asegurable",null,null,null,null,{"$f":"+Simulador_Cliente!$C$18","v":602716},null,null,null,"Factor Aplicado - Ajustada",null,null,null,null,{"$f":"ROUND(($Q$11/100)/($Q$9/$Q$12),8)","v":1.560577E-2},"tem convertida de manera nominal a los dias entre cuotas"]
[null,null,"Tasa de Seguro Todo Riesgo",null,null,null,null,2.9E-4,{"$f":"+H14*12","v":3.48E-3},{"$f":"+I14/365*30*H13","v":172.39328876712329},null,"Factor Aplicado para la cuota - Ajustada",null,null,null,null,{"$f":"1/((1-((1+$Q$13)^(-1*$H$15)))/$Q$13)","v":2.1446054440715945E-2},"Factor de cuota (ok)"]
[null,null,"Plazo y  Nro. Cuotas",null,null,null,null,{"$f":"+Simulador_Cliente!C11","v":84},{"$f":"H15","v":84},null,null,"Interes de Gracia  (Se considera la TEA Normal)",null,null,null,null,{"$f":"IF(H16>0,ROUND(H6*(((1+H8/100)^(ABS(H16)/Q9))-1),4),ROUND(H6*(((1+H8/100)^(ABS(H16)/Q9))-1),4) * -1)","v":17966.175999999999},"Ok"]
[null,null,"Días de Gracia",null,null,null,null,{"$f":"+Simulador_Cliente!C13","v":35},null,null,null,"Saldo Interes +/- Interes Gracia",null,null,null,null,{"$f":"IF(H7 + Q15>0,H7+ Q15,0)","v":17966.175999999999}]
[null,null,"Mes de No Pago 1",null,null,null,null,0,null,null,null,"Seg Desg de Gracia",null,null,null,null,{"$f":"IF(H16>0,ROUNDDOWN(H5*H9/30*H16,2),ROUNDDOWN(H5*H9/30*H16,2)*0)","v":3488.33}]
[null,null,"Mes de No Pago 2",null,null,null,null,0,null,null,null,"TCEA",null,null,null,null,{"$f":"+AM32","v":0.23895625495428052}]
[null,null,"Mes Cuota Doble 1",null,null,null,null,0]
[null,null,"Mes Cuota Doble 2",null,null,null," ",0]
{"$rows_left_out":256}
{"sheet":"Cronograma_Referencial (2)","index":4,"n_rows":93,"n_cols":10,"rows_kept":93,"cut":false,"hidden":true,"merged":[[4,1,4,9],[5,1,5,9],[8,1,8,2],[8,5,8,6],[9,1,9,2],[9,5,9,6],[13,5,13,6],[10,1,10,2],[10,5,10,6],[11,1,11,2],[11,5,11,6],[12,1,12,2],[12,5,12,6]]}
["Simulador12345"]
[]
[]
[]
[null,"(SIMULACIÓN)"]
[null,"CRONOGRAMA DE PAGOS"]
[]
[]
[null,"Moneda                                                  :",null,{"$f":"+Simulador_Cliente!C7","v":"Soles"},null,"Monto del Préstamo                                                  :",null,{"$f":"+Simulador_Cliente!C9","v":1000000}]
[null,"Producto                                                :",null,{"$f":"+Simulador_Cliente!C8","v":"Capital de Trabajo PYME"},null,"Tasa Efectiva Anual                                                  :",null,{"$f":"+Simulador_Cliente!C12&\"%\"","v":"20.1%"}]
[null,"Fecha de desembolso                          :",null,{"$f":"+Simulador_Cliente!C10","v":"2022-07-17"},null,"Tasa de Costo Efectiva Anual                                   :",null,{"$f":"+((1+I11)^12)-1","v":{"$error":"#VALUE!"}},{"$f":"+RATE(D12,J18,-H9-I12)","v":{"$error":"#VALUE!"}}]
[null,"Plazo (en meses)                                                          :",null,{"$f":"+Simulador_Cliente!C11","v":84},null,"Tasa Seguro de Desgravamen Mensual                   :",null,{"$f":"+IF(Simulador_Cliente!C14=\"Endoso\",0,0.083%)","v":8.3000000000000001E-4},{"$f":"+#REF!","v":{"$error":"#REF!"}}]
[null,"Periodo de gracia                                 :",null,{"$f":"+Simulador_Cliente!C13&\" \"& \"días\"","v":"35 días"},null,"Tasa Seguro de Seguro Multiriesgo                         :",null,{"$f":"+IF(Simulador_Cliente!C16=\"No\",0,0.07%)","v":7.000000000000001E-4}]
[null,null,null,null,null,"Tasa Seguro Todo Riesgo                                        :",null,{"$f":"+IF(Simulador_Cliente!C17=\"No\",0,0.0292%)","v":2.92E-4}]
[]
[]
[null,"N°","Fecha Vencimiento","Capital","Interes","Interes de Gracia","Seguro Desgravamen","Seguro Multiriesgos","Seguro Todo Riesgo","Total Cuota"]
[null,1,{"$f":"IFERROR(+IF(B18>0,VLOOKUP(B18,#REF!,3,0),\" \"),\" \")","v":" "},{"$f":"IFERROR(+IF(B18>0,VLOOKUP(B18,#REF!,13,0),\" \"),\" \")","v":" "},{"$f":"IFERROR(+IF(B18>0,VLOOKUP(B18,Simulador_v2!$A$33:$AJ$273,12,0),\" \"),\" \")","v":15379.95},{"$f":"IFERROR(+IF(B18>0,VLOOKUP(B18,#REF!,15,0),\" \"),\" \")","v":" "},{"$f":"IFERROR(+IF(B18>0,VLOOKUP(B18,Simulador_v2!$A$33:$AJ$273,20,0),\" \"),\" \")","v":6478.33},{"$f":"IFERROR(+IF(B18>0,VLOOKUP(B18,#REF!,20,0),\" \"),\" \")","v":" "},{"$f":"IFERROR(+IF(B18>0,VLOOKUP(B18,#REF!,22,0),\" \"),\" \")","v":" "},{"$f":"IFERROR(+IF(B18>0,VLOOKUP(B18,#REF!,23,0),\" \"),\" \")","v":" "}]
[null,{"$f":"IF(B18=0,\" \",IF(B18>=$D$12,\"\",B18+1))","v":2},{"$f":"IF($D$12=0,\" \",IF(B18=$D$12,\"TOTALES\",+IF(B19>0,VLOOKUP(B19,#REF!,3,0),\" \")))","v":{"$error":"#REF!"}},{"$f":"IF($D$12=0,\" \",IF(B18=$D$12,#REF!,+IF(B19>0,VLOOKUP(B19,#REF!,13,0),\" \")))","v":{"$error":"#REF!"}},{"$f":"IF($D$12=0,\" \",IF(B18=$D$12,#REF!,+IF(B19>0,VLOOKUP(B19,#REF!,14,0),\" \")))","v":{"$error":"#REF!"}},{"$f":"IF($D$12=0,\" \",IF(B18=$D$12,#REF!,+IF(B19>0,VLOOKUP(B19,#REF!,15,0),\" \")))","v":{"$error":"#REF!"}},{"$f":"IF($D$12=0,\" \",IF(B18=$D$12,Simulador_v2!$T$32,+IF(B19>0,VLOOKUP(B19,Simulador_v2!$A$33:$AJ$273,20,0),\" \")))","v":3089.95},{"$f":"IF($D$12=0,\" \",IF(B18=$D$12,#REF!,+IF(B19>0,VLOOKUP(B19,#REF!,20,0),\" \")))","v":{"$error":"#REF!"}},{"$f":"IF($D$12=0,\" \",IF(B18=$D$12,#REF!,+IF(B19>0,VLOOKUP(B19,#REF!,22,0),\" \")))","v":{"$error":"#REF!"}},{"$f":"IF($D$12=0,\" \",IF(B18=$D$12,#REF!,+IF(B19>0,VLOOKUP(B19,#REF!,23,0),\" \")))","v":{"$error":"#REF!"}}]
[null,3,{"$f":"IF($D$12=0,\" \",IF(B19=$D$12,\"TOTALES\",+IF(B20>0,VLOOKUP(B20,#REF!,3,0),\" \")))","v":{"$error":"#REF!"}},{"$f":"IF($D$12=0,\" \",IF(B19=$D$12,#REF!,+IF(B20>0,VLOOKUP(B20,#REF!,13,0),\" \")))","v":{"$error":"#REF!"}},{"$f":"IF($D$12=0,\" \",IF(B19=$D$12,#REF!,+IF(B20>0,VLOOKUP(B20,#REF!,14,0),\" \")))","v":{"$error":"#REF!"}},{"$f":"IF($D$12=0,\" \",IF(B19=$D$12,#REF!,+IF(B20>0,VLOOKUP(B20,#REF!,15,0),\" \")))","v":{"$error":"#REF!"}},{"$f":"IF($D$12=0,\" \",IF(B19=$D$12,Simulador_v2!$T$32,+IF(B20>0,VLOOKUP(B20,Simulador_v2!$A$33:$AJ$273,20,0),\" \")))","v":2978.92},{"$f":"IF($D$12=0,\" \",IF(B19=$D$12,#REF!,+IF(B20>0,VLOOKUP(B20,#REF!,20,0),\" \")))","v":{"$error":"#REF!"}},{"$f":"IF($D$12=0,\" \",IF(B19=$D$12,#REF!,+IF(B20>0,VLOOKUP(B20,#REF!,22,0),\" \")))","v":{"$error":"#REF!"}},{"$f":"IF($D$12=0,\" \",IF(B19=$D$12,#REF!,+IF(B20>0,VLOOKUP(B20,#REF!,23,0),\" \")))","v":{"$error":"#REF!"}}]
{"$rows_left_out":73}