{"text_format":"1","workbook":"xlsx","n_sheets":4,"sheets":["Simulador","Calculos","Simulador_Cliente","Cronograma_Referencial"],"not_rendered":{"charts":0,"images":2,"macros":1,"external_links":0,"defined_names":0,"comments":1,"pivot_tables":0},"unopened":[],"bounds":{"document_bytes":16777216,"sheet_cells":100000,"rows_first":2000,"rows_last":500,"rows_between":2000,"halvings":0,"cell_chars":16384,"cell_head_chars":4096},"cells_cut":0,"cells_raw":0,"read":"whole","date_system":"1900"}

{"sheet":"Simulador","index":0,"n_rows":1000,"n_cols":30,"rows_kept":1000,"cut":false,"hidden":true,"merged":[[1,2,1,24]]}
[]
[null,null,"SIMULADOR DE CUOTAS"]
[]
[]
[null,null,"Importe Solicitado",null,null,null,null,{"$f":"+Simulador_Cliente!C9","v":50000},null,null,null,null,null,"Fecha Desembolso",null,null,null,null,{"$f":"+Simulador_Cliente!C10","v":"2022-02-08"}]
[null,null,"Saldo de Capital",null,null,null,null,{"$f":"H5","v":50000},null,null,null,null,null,"Fecha Final de Gracia",null,null,null,null,{"$f":"DATE(YEAR(S5+H14),MONTH(S5 + H14),DAY(S5 +H14))","v":"2022-03-10"}]
[null,null,"Saldo de Interes",null,null,null,null,0,null,null,null,null,null,"Fecha de la 1° cuota",null,null,null,null,{"$f":"DATE(YEAR(EDATE(S6,1)),MONTH(EDATE(S6,1)),DAY(EDATE(S6,1)))","v":"2022-04-10"}]
[null,null,"Tasa Anual (TEA)",null,null,null,null,{"$f":"+Simulador_Cliente!C12","v":20},null,null,null,null,null,"Fecha final de vencimiento",null,null,null,null,{"$f":"DATE(YEAR(EDATE(S6,H13)),MONTH(EDATE(S6,H13)),DAY(EDATE(S6,H13)))","v":"2025-03-10"}]
[null,null,"Tasa de Seguro de Desgravámen",null,null,null,null,{"$f":"+Cronograma_Referencial!H12","v":8.3000000000000001E-4},null,null,null,null,null,"Base",null,null,null,null,360]
[null,null,"Seguro Multiriesgo",null,null,null,null,{"$f":"IF(J10=\"Sí\",($H$5*$I$10),0)","v":35},6.9999999999999999E-4,{"$f":"+Simulador_Cliente!C15","v":"Sí"},null,null,null,"Frecuencia pago en días",null,null,null,null,30]
[null,null,"Valor garantía",null,null,null,null,{"$f":"+Simulador_Cliente!C17","v":0},2.92E-4,{"$f":"+I11*H11","v":0},{"$f":"+Simulador_Cliente!C16","v":"No"},null,null,"Tasa Equivalente",null,null,null,null,{"$f":"ROUND((((H8/100+1)^(1/(S9/S10))-1)*S9/S10)*100,6)","v":18.371365000000001},null,null,null,"tea conv. A tem luego nominal anual"]
[null,null,null,null,null,null,null,null,null,null,null,null,null,"Días entre cuotas",null,null,null,null,{"$f":"(S8-S6)/H13","v":30.444444444444443},null,null,null,"dias promedio entre cuotas"]
[null,null,"Plazo y  Nro. Cuotas",null,null,null,null,{"$f":"+Simulador_Cliente!C11","v":36},{"$f":"IF(H16+ H17>0,VLOOKUP(H13,#REF!,2,FALSE),H13)","v":36},null,null,null,null,"Factor Aplicado",null,null,null,null,{"$f":"($S$11/100)/($S$9/$S$12)","v":1.5536277808641974E-2},null,null,null,"tem convertida de manera nominal a los dias entre cuotas"]
[null,null,"Días de Gracia",null,null,null,null,{"$f":"+Simulador_Cliente!C13","v":30},null,null,null,null,null,"Factor Aplicado para la cuota",null,null,null,null,{"$f":"1/((1-((1+$S$13)^(-1*$H$13)))/$S$13)","v":3.6476041990775206E-2},null,null,null,"Factor de cuota (ok)"]
[null,null,"(+/- 30 días antes de la fecha 1° cuota)",null,null,null,null,null,null,null,null,null,null,"Interes de Gracia ",null,null,null,null,{"$f":"IF(H14>0,ROUND(H6*(((1+H8/100)^(ABS(H14)/S9))-1),4),ROUND(H6*(((1+H8/100)^(ABS(H14)/S9))-1),4) * -1)","v":765.47349999999994},null,null,null,"Ok"]
[null,null,"Mes de No Pago 1",null,null,null,null,0,null,null,null,null,null,"Saldo Interes +/- Interes Gracia",null,null,null,null,{"$f":"IF(H7 + S15>0,H7+ S15,0)","v":765.47349999999994}]
[null,null,"Mes de No Pago 2",null,null,null,null,0]
[null,null,"Mes Cuota Doble 1"]
[null,null,"Mes Cuota Doble 2"]
[]
{"$rows_left_out":981}
{"sheet":"Calculos","index":1,"n_rows":386,"n_cols":7,"rows_kept":386,"cut":false,"hidden":true,"merged":[[0,0,0,6]]}
["Factores utilizados en Meses de No Pago para cálculo del valor cuota"]
[]
["N° de Cuota","Equivalente","Fecha","Mes","Marca Cuota No Pago","Factor (10)","Acumulado"]
[1,{"$f":"IF(E4<>\"C\",IF(ISERROR(1+B3)=TRUE,1,1+B3),IF(ISNUMBER(B3),B3,1))","v":1},{"$f":"+Simulador!S7","v":"2022-04-10"},{"$f":"MONTH(C4)","v":4},{"$f":"IF(ISERROR(MATCH(D4,Simulador!$H$16:$H$17,0))=FALSE,\"C\",IF(ISERROR(MATCH(D4,Simulador!$H$18:$H$19,0))=FALSE,\"D\",\"\"))","v":""},{"$f":"IF(E4=\"C\",0,IF(E4 =\"D\",ROUND(1/((1+Simulador!$S$13)^A4),9) * 2,ROUND(1/((1+Simulador!$S$13)^A4),9)))","v":0.98470140500000003},{"$f":"ROUND(F4,9)","v":0.98470140500000003}]
[{"$f":"A4+1","v":2},{"$f":"IF(E5<>\"C\",IF(ISERROR(1+B4)=TRUE,1,1+B4),IF(ISNUMBER(B4),B4,1))","v":2},{"$f":"DATE(YEAR(C4) + 1/12,MONTH(C4)+1,DAY(C4))","v":"2022-05-10"},5,{"$f":"IF(ISERROR(MATCH(D5,Simulador!$H$16:$H$17,0))=FALSE,\"C\",IF(ISERROR(MATCH(D5,Simulador!$H$18:$H$19,0))=FALSE,\"D\",\"\"))","v":""},{"$f":"IF(E5=\"C\",0,IF(E5 =\"D\",ROUND(1/((1+Simulador!$S$13)^A5),9) * 2,ROUND(1/((1+Simulador!$S$13)^A5),9)))","v":0.96963685799999999},{"$f":"G4+ROUND(F5,9)","v":1.9543382629999999}]
[3,3,"2022-06-10",6,{"$f":"IF(ISERROR(MATCH(D6,Simulador!$H$16:$H$17,0))=FALSE,\"C\",IF(ISERROR(MATCH(D6,Simulador!$H$18:$H$19,0))=FALSE,\"D\",\"\"))","v":""},{"$f":"IF(E6=\"C\",0,IF(E6 =\"D\",ROUND(1/((1+Simulador!$S$13)^A6),9) * 2,ROUND(1/((1+Simulador!$S$13)^A6),9)))","v":0.95480277700000005},{"$f":"G5+ROUND(F6,9)","v":2.9091410399999997}]
[4,4,"2022-07-10",7,{"$f":"IF(ISERROR(MATCH(D7,Simulador!$H$16:$H$17,0))=FALSE,\"C\",IF(ISERROR(MATCH(D7,Simulador!$H$18:$H$19,0))=FALSE,\"D\",\"\"))","v":""},{"$f":"IF(E7=\"C\",0,IF(E7 =\"D\",ROUND(1/((1+Simulador!$S$13)^A7),9) * 2,ROUND(1/((1+Simulador!$S$13)^A7),9)))","v":0.940195636},3.8493366759999996]
[5,5,"2022-08-10",8,{"$f":"IF(ISERROR(MATCH(D8,Simulador!$H$16:$H$17,0))=FALSE,\"C\",IF(ISERROR(MATCH(D8,Simulador!$H$18:$H$19,0))=FALSE,\"D\",\"\"))","v":""},{"$f":"IF(E8=\"C\",0,IF(E8 =\"D\",ROUND(1/((1+Simulador!$S$13)^A8),9) * 2,ROUND(1/((1+Simulador!$S$13)^A8),9)))","v":0.92581196399999999},4.7751486399999994]
[6,6,"2022-09-10",9,{"$f":"IF(ISERROR(MATCH(D9,Simulador!$H$16:$H$17,0))=FALSE,\"C\",IF(ISERROR(MATCH(D9,Simulador!$H$18:$H$19,0))=FALSE,\"D\",\"\"))","v":""},{"$f":"IF(E9=\"C\",0,IF(E9 =\"D\",ROUND(1/((1+Simulador!$S$13)^A9),9) * 2,ROUND(1/((1+Simulador!$S$13)^A9),9)))","v":0.911648342},5.6867969819999997]
[7,7,"2022-10-10",10,{"$f":"IF(ISERROR(MATCH(D10,Simulador!$H$16:$H$17,0))=FALSE,\"C\",IF(ISERROR(MATCH(D10,Simulador!$H$18:$H$19,0))=FALSE,\"D\",\"\"))","v":""},{"$f":"IF(E10=\"C\",0,IF(E10 =\"D\",ROUND(1/((1+Simulador!$S$13)^A10),9) * 2,ROUND(1/((1+Simulador!$S$13)^A10),9)))","v":0.89770140399999998},6.5844983859999999]
[8,8,"2022-11-10",11,{"$f":"IF(ISERROR(MATCH(D11,Simulador!$H$16:$H$17,0))=FALSE,\"C\",IF(ISERROR(MATCH(D11,Simulador!$H$18:$H$19,0))=FALSE,\"D\",\"\"))","v":""},{"$f":"IF(E11=\"C\",0,IF(E11 =\"D\",ROUND(1/((1+Simulador!$S$13)^A11),9) * 2,ROUND(1/((1+Simulador!$S$13)^A11),9)))","v":0.88396783400000001},7.4684662199999998]
[9,9,"2022-12-10",12,{"$f":"IF(ISERROR(MATCH(D12,Simulador!$H$16:$H$17,0))=FALSE,\"C\",IF(ISERROR(MATCH(D12,Simulador!$H$18:$H$19,0))=FALSE,\"D\",\"\"))","v":""},{"$f":"IF(E12=\"C\",0,IF(E12 =\"D\",ROUND(1/((1+Simulador!$S$13)^A12),9) * 2,ROUND(1/((1+Simulador!$S$13)^A12),9)))","v":0.87044436800000002},8.3389105879999992]
[10,10,"2023-01-10",1,{"$f":"IF(ISERROR(MATCH(D13,Simulador!$H$16:$H$17,0))=FALSE,\"C\",IF(ISERROR(MATCH(D13,Simulador!$H$18:$H$19,0))=FALSE,\"D\",\"\"))","v":""},{"$f":"IF(E13=\"C\",0,IF(E13 =\"D\",ROUND(1/((1+Simulador!$S$13)^A13),9) * 2,ROUND(1/((1+Simulador!$S$13)^A13),9)))","v":0.85712779299999997},9.1960383809999993]
[11,11,"2023-02-10",2,{"$f":"IF(ISERROR(MATCH(D14,Simulador!$H$16:$H$17,0))=FALSE,\"C\",IF(ISERROR(MATCH(D14,Simulador!$H$18:$H$19,0))=FALSE,\"D\",\"\"))","v":""},{"$f":"IF(E14=\"C\",0,IF(E14 =\"D\",ROUND(1/((1+Simulador!$S$13)^A14),9) * 2,ROUND(1/((1+Simulador!$S$13)^A14),9)))","v":0.84401494200000005},10.040053322999999]
[12,12,"2023-03-10",3,{"$f":"IF(ISERROR(MATCH(D15,Simulador!$H$16:$H$17,0))=FALSE,\"C\",IF(ISERROR(MATCH(D15,Simulador!$H$18:$H$19,0))=FALSE,\"D\",\"\"))","v":""},{"$f":"IF(E15=\"C\",0,IF(E15 =\"D\",ROUND(1/((1+Simulador!$S$13)^A15),9) * 2,ROUND(1/((1+Simulador!$S$13)^A15),9)))","v":0.83110269999999997},10.871156022999999]
[13,13,"2023-04-10",4,{"$f":"IF(ISERROR(MATCH(D16,Simulador!$H$16:$H$17,0))=FALSE,\"C\",IF(ISERROR(MATCH(D16,Simulador!$H$18:$H$19,0))=FALSE,\"D\",\"\"))","v":""},{"$f":"IF(E16=\"C\",0,IF(E16 =\"D\",ROUND(1/((1+Simulador!$S$13)^A16),9) * 2,ROUND(1/((1+Simulador!$S$13)^A16),9)))","v":0.81838799699999998},11.68954402]
[14,14,"2023-05-10",5,{"$f":"IF(ISERROR(MATCH(D17,Simulador!$H$16:$H$17,0))=FALSE,\"C\",IF(ISERROR(MATCH(D17,Simulador!$H$18:$H$19,0))=FALSE,\"D\",\"\"))","v":""},{"$f":"IF(E17=\"C\",0,IF(E17 =\"D\",ROUND(1/((1+Simulador!$S$13)^A17),9) * 2,ROUND(1/((1+Simulador!$S$13)^A17),9)))","v":0.80586780999999996},12.49541183]
[15,15,"2023-06-10",6,{"$f":"IF(ISERROR(MATCH(D18,Simulador!$H$16:$H$17,0))=FALSE,\"C\",IF(ISERROR(MATCH(D18,Simulador!$H$18:$H$19,0))=FALSE,\"D\",\"\"))","v":""},{"$f":"IF(E18=\"C\",0,IF(E18 =\"D\",ROUND(1/((1+Simulador!$S$13)^A18),9) * 2,ROUND(1/((1+Simulador!$S$13)^A18),9)))","v":0.79353916599999996},13.288950996000001]
[16,16,"2023-07-10",7,{"$f":"IF(ISERROR(MATCH(D19,Simulador!$H$16:$H$17,0))=FALSE,\"C\",IF(ISERROR(MATCH(D19,Simulador!$H$18:$H$19,0))=FALSE,\"D\",\"\"))","v":""},{"$f":"IF(E19=\"C\",0,IF(E19 =\"D\",ROUND(1/((1+Simulador!$S$13)^A19),9) * 2,ROUND(1/((1+Simulador!$S$13)^A19),9)))","v":0.781399132},14.070350128000001]
[17,17,"2023-08-10",8,{"$f":"IF(ISERROR(MATCH(D20,Simulador!$H$16:$H$17,0))=FALSE,\"C\",IF(ISERROR(MATCH(D20,Simulador!$H$18:$H$19,0))=FALSE,\"D\",\"\"))","v":""},{"$f":"IF(E20=\"C\",0,IF(E20 =\"D\",ROUND(1/((1+Simulador!$S$13)^A20),9) * 2,ROUND(1/((1+Simulador!$S$13)^A20),9)))","v":0.76944482299999994},14.839794951000002]
{"$rows_left_out":367}
{"sheet":"Simulador_Cliente","index":2,"n_rows":20,"n_cols":31,"rows_kept":20,"cut":false,"hidden":false,"merged":[[17,0,17,1],[18,0,18,1],[2,2,3,3]]}
[]
[]
[null,null,"SIMULADOR PRÉSTAMO BANCA EMPRENDEDORA MYPE",null,null,null,"Soles"]
[null,null,null,null,null,null,"Dólares"]
[]
[null,null,null,null,null,null,"No"]
[null,"Moneda","Soles",null,null,null,"Julio"]
[null,"Producto","Vivienda",null,null,null,"Diciembre"]
[null,"Monto del Préstamo",50000]
[null,"Fecha de Desembolso","2022-02-08",null,null,null,null,null,null,null,null,null,0]
[null,"Plazo",36,null,null,null,"Banco",null,null,null,null,null,30,null,null,null,null,{"$f":"IF(C8=G20,C11<=18,IF(C8=G17,C11<=24,C11<=36))","v":true},"O(C11=\" \";Y(C11>=1;C11<=60))"]
[null,"TEA",20,null,null,null,"Endoso",null,null,null,null,null,60]
[null,"Días de Gracia",30,null,null,null,null,null,null,null,null,null,90]
[null,"Seguro Desgravamen","Banco",null,null,null,"Sí",null,null,null,null,null,180]
[null,"Seguro Multiriesgo","Sí",null,null,null,"No"]
[null,"Seguro Todo Riesgo","No"]
[null,{"$f":"+IF(C16=\"Sí\",\"Valor del Bien a asegurar\",\"\")","v":""},null,null,null,null,"Capital de Trabajo",null,null,null,null,null,null,null,null,null,null,180,24,null,null,null,null,null,null,null,null,null,null,null,{"$f":"OR(C17=\" \",C17>C9)","v":false}]
[null,null,null,null,null,null,"Activo Fijo",null,null,null,null,null,null,null,180,null,null,null,36]
[null,null,null,null,null,null,"Vivienda",null,null,null,null,null,null,null,90,null,null,null,36]
[null,null,null,null,null,null,"Consumo",null,null,null,null,null,null,null,60,null,null,null,18]
{"$rows_left_out":1}
{"sheet":"Cronograma_Referencial","index":3,"n_rows":93,"n_cols":10,"rows_kept":93,"cut":false,"hidden":false,"merged":[[13,5,13,6],[12,1,12,2],[12,5,12,6],[4,1,4,9],[5,1,5,9],[8,1,8,2],[9,1,9,2],[10,1,10,2],[8,5,8,6],[9,5,9,6],[11,1,11,2],[10,5,10,6],[11,5,11,6]]}
[]
[]
[]
[]
[null,"(SIMULACIÓN)"]
[null,"CRONOGRAMA DE PAGOS"]
[]
[]
[null,"Moneda                                                  :",null,{"$f":"+Simulador_Cliente!C7","v":"Soles"},null,"Monto del Préstamo                                                  :",null,{"$f":"+Simulador_Cliente!C9","v":50000}]
[null,"Producto                                                :",null,{"$f":"+Simulador_Cliente!C8","v":"Vivienda"},null,"Tasa Efectiva Anual                                                  :",null,{"$f":"+Simulador_Cliente!C12&\"%\"","v":"20%"}]
[null,"Fecha de desembolso                          :",null,{"$f":"+Simulador_Cliente!C10","v":"2022-02-08"},null,"Tasa de Costo Efectiva Anual                                   :",null,{"$f":"+((1+I11)^12)-1","v":0.23560556854864312},{"$f":"+RATE(D12,J18,-H9-I12)","v":1.7786426602647894E-2}]
[null,"Plazo (en meses)                                                          :",null,{"$f":"+Simulador_Cliente!C11","v":36},null,"Tasa Seguro de Desgravamen Mensual                   :",null,{"$f":"+IF(Simulador_Cliente!C14=\"Endoso\",0,0.083%)","v":8.3000000000000001E-4},{"$f":"+Simulador!S16","v":765.47349999999994}]
[null,"Periodo de gracia                                 :",null,{"$f":"+Simulador_Cliente!C13&\" \"& \"días\"","v":"30 días"},null,"Tasa Seguro de Seguro Multiriesgo                         :",null,{"$f":"+IF(Simulador_Cliente!C15=\"No\",0,0.07%)","v":7.000000000000001E-4}]
[null,null,null,null,null,"Tasa Seguro Todo Riesgo                                        :",null,{"$f":"+IF(Simulador_Cliente!C16=\"No\",0,0.0292%)","v":0}]
[]
[]
[null,"N°","Fecha Vencimiento","Capital","Interes","Interes de Gracia","Seguro Desgravamen","Seguro Multiriesgos","Seguro Todo Riesgo","Total Cuota"]
[null,1,{"$f":"IFERROR(+IF(B18>0,VLOOKUP(B18,Simulador!$A$32:$W$550,3,0),\" \"),\" \")","v":"2022-04-10"},{"$f":"IFERROR(+IF(B18>0,VLOOKUP(B18,Simulador!$A$32:$W$550,13,0),\" \"),\" \")","v":956.1099999999999},{"$f":"IFERROR(+IF(B18>0,VLOOKUP(B18,Simulador!$A$32:$W$550,14,0),\" \"),\" \")","v":791.19},{"$f":"IFERROR(+IF(B18>0,VLOOKUP(B18,Simulador!$A$32:$W$550,15,0),\" \"),\" \")","v":21.263152777777776},{"$f":"IFERROR(+IF(B18>0,VLOOKUP(B18,Simulador!$A$32:$W$550,19,0),\" \"),\" \")","v":83},{"$f":"IFERROR(+IF(B18>0,VLOOKUP(B18,Simulador!$A$32:$W$550,20,0),\" \"),\" \")","v":70},{"$f":"IFERROR(+IF(B18>0,VLOOKUP(B18,Simulador!$A$32:$W$550,22,0),\" \"),\" \")","v":0},{"$f":"IFERROR(+IF(B18>0,VLOOKUP(B18,Simulador!$A$32:$W$550,23,0),\" \"),\" \")","v":1921.5631527777778}]
[null,{"$f":"IF(B18=0,\" \",IF(B18>=$D$12,\"\",B18+1))","v":2},{"$f":"IF($D$12=0,\" \",IF(B18=$D$12,\"TOTALES\",+IF(B19>0,VLOOKUP(B19,Simulador!$A$32:$W$550,3,0),\" \")))","v":"2022-05-10"},{"$f":"IF($D$12=0,\" \",IF(B18=$D$12,Simulador!$M$30,+IF(B19>0,VLOOKUP(B19,Simulador!$A$32:$W$550,13,0),\" \")))","v":1072.96},{"$f":"IF($D$12=0,\" \",IF(B18=$D$12,Simulador!$N$30,+IF(B19>0,VLOOKUP(B19,Simulador!$A$32:$W$550,14,0),\" \")))","v":750.84},{"$f":"IF($D$12=0,\" \",IF(B18=$D$12,Simulador!$O$30,+IF(B19>0,VLOOKUP(B19,Simulador!$A$32:$W$550,15,0),\" \")))","v":21.263152777777776},{"$f":"IF($D$12=0,\" \",IF(B18=$D$12,Simulador!$S$30,+IF(B19>0,VLOOKUP(B19,Simulador!$A$32:$W$550,19,0),\" \")))","v":41.5},{"$f":"IF($D$12=0,\" \",IF(B18=$D$12,Simulador!$T$30,+IF(B19>0,VLOOKUP(B19,Simulador!$A$32:$W$550,20,0),\" \")))","v":35},{"$f":"IF($D$12=0,\" \",IF(B18=$D$12,Simulador!$V$30,+IF(B19>0,VLOOKUP(B19,Simulador!$A$32:$W$550,22,0),\" \")))","v":0},{"$f":"IF($D$12=0,\" \",IF(B18=$D$12,Simulador!$W$30,+IF(B19>0,VLOOKUP(B19,Simulador!$A$32:$W$550,23,0),\" \")))","v":1921.563152777778}]
[null,3,{"$f":"IF($D$12=0,\" \",IF(B19=$D$12,\"TOTALES\",+IF(B20>0,VLOOKUP(B20,Simulador!$A$32:$W$550,3,0),\" \")))","v":"2022-06-10"},{"$f":"IF($D$12=0,\" \",IF(B19=$D$12,Simulador!$M$30,+IF(B20>0,VLOOKUP(B20,Simulador!$A$32:$W$550,13,0),\" \")))","v":1064.7199999999998},{"$f":"IF($D$12=0,\" \",IF(B19=$D$12,Simulador!$N$30,+IF(B20>0,VLOOKUP(B20,Simulador!$A$32:$W$550,14,0),\" \")))","v":759.08},{"$f":"IF($D$12=0,\" \",IF(B19=$D$12,Simulador!$O$30,+IF(B20>0,VLOOKUP(B20,Simulador!$A$32:$W$550,15,0),\" \")))","v":21.263152777777776},{"$f":"IF($D$12=0,\" \",IF(B19=$D$12,Simulador!$S$30,+IF(B20>0,VLOOKUP(B20,Simulador!$A$32:$W$550,19,0),\" \")))","v":41.5},{"$f":"IF($D$12=0,\" \",IF(B19=$D$12,Simulador!$T$30,+IF(B20>0,VLOOKUP(B20,Simulador!$A$32:$W$550,20,0),\" \")))","v":35},{"$f":"IF($D$12=0,\" \",IF(B19=$D$12,Simulador!$V$30,+IF(B20>0,VLOOKUP(B20,Simulador!$A$32:$W$550,22,0),\" \")))","v":0},{"$f":"IF($D$12=0,\" \",IF(B19=$D$12,Simulador!$W$30,+IF(B20>0,VLOOKUP(B20,Simulador!$A$32:$W$550,23,0),\" \")))","v":1921.5631527777775}]
{"$rows_left_out":73}